Travel time
type: ExperimentParameter
type: FAIRDigitalObject
type: DatatypeProperty
conforms to: TrivialProfile
conforms to: travelTimeProfile
is materialized by: travelTime.ttl
comment: The time required for a robot to travel from start to end of the track, measured in seconds.
range: Datatype
  on datatype: float
  with restrictions:
    min inclusive: 0.0
unit: SEC