Person
type: Class
subclass of: Restriction
  min cardinality: 0
  on property: orcidId
subclass of: Restriction
  all values from: string
  on property: orcidId
subclass of: Restriction
  max cardinality: 1
  on property: orcidId
subclass of: PersonOrOrganization
definition: An individual.
in scheme: evorao

Audio
type: Class
subclass of: File
broad match: MediaType
definition: Subclass of File representing sound recordings or audio tracks.
in scheme: evorao

Bacterium
type: Class
subclass of: Pathogen
definition: The bacterium as a biological material.
in scheme: evorao
related match: DOID 104
related match: MONDO_0005113
related match: NCBITaxon 2
related match: http://snomed.info/id/41146007

Bundle
type: Class
subclass of: Restriction
  all values from: ProductOrService
  on property: itemsOfTheBundle
subclass of: Restriction
  min cardinality: 1
  on property: itemsOfTheBundle
subclass of: Product
definition: A grouping of products and/or services intentionally combined into a single offering, typically to provide added value, convenience, or specific experimental utility.
in scheme: evorao
related match: NCIT C54696

ClinicalGroup
type: Class
title: Clinical group
subclass of: Restriction
  all values from: Taxon
  on property: taxon
subclass of: Restriction
  min cardinality: 1
  on property: taxon
subclass of: Restriction
  all values from: AlternateName
  on property: alternateName
subclass of: Restriction
  min cardinality: 0
  on property: alternateName
subclass of: Term
definition: A syndromic grouping of pathogens, based on typical disease manifestation, clinical syndrome, or primary system affected. Examples include Respiratory viruses, Hemorrhagic viruses, and Gastroenteritis viruses. Clinical groups are not taxonomic categories but practical classifications used in medicine, epidemiology, and public health.
in scheme: evorao

DetectionKit
type: Class
title: Detection Kit
subclass of: Restriction
  min cardinality: 0
  on property: specificityDocumented
subclass of: Restriction
  max cardinality: 1
  on property: specificityDocumented
subclass of: Restriction
  max cardinality: 1
  on property: targetedRegion
subclass of: Restriction
  all values from: string
  on property: targetedRegion
subclass of: Restriction
  min cardinality: 0
  on property: targetedRegion
subclass of: Restriction
  min cardinality: 0
  on property: standardOperatingProcedureFile
subclass of: Restriction
  max cardinality: 1
  on property: specificity
subclass of: Restriction
  all values from: File
  on property: standardOperatingProcedureFile
subclass of: Restriction
  all values from: string
  on property: specificity
subclass of: Restriction
  all values from: boolean
  on property: specificityDocumented
subclass of: Restriction
  min cardinality: 0
  on property: specificity
subclass of: Product
definition: A detection kit for specific pathogens.
in scheme: evorao

Fungus
type: Class
subclass of: Pathogen
definition: The fungus as a biological material.
in scheme: evorao
related match: DOID 1564
related match: MONDO_0002041
related match: NCBITaxon 4751
related match: http://snomed.info/id/414561005

Hybridoma
type: Class
subclass of: Restriction
  max cardinality: 1
  on property: hybridomaDescription
subclass of: Restriction
  min cardinality: 0
  on property: hybridomaDescription
subclass of: Restriction
  all values from: string
  on property: hybridomaDescription
subclass of: Antibody
definition: An hybridoma that provides antibodies that can be related to a pathogen.
in scheme: evorao

NaturalPartOrigin
type: Class
title: Natural part origin
subclass of: Restriction
  min cardinality: 1
  on property: countryOfCollection
subclass of: Restriction
  max cardinality: 1
  on property: collectedBeforeDate
subclass of: Restriction
  max cardinality: 1
  on property: indigenousPeopleAndLocalCommunityOrigin
subclass of: Restriction
  all values from: boolean
  on property: collectedBeforeDate
subclass of: Restriction
  all values from: IplcOrigin
  on property: indigenousPeopleAndLocalCommunityOrigin
subclass of: Restriction
  min cardinality: 1
  on property: collectionDate
subclass of: Restriction
  max cardinality: 1
  on property: permitIdentifierForAbs
subclass of: Restriction
  all values from: string
  on property: permitIdentifierForAbs
subclass of: Restriction
  max cardinality: 1
  on property: collectionDate
subclass of: Restriction
  min cardinality: 0
  on property: permitIdentifierForAbs
subclass of: Restriction
  max cardinality: 1
  on property: countryOfCollection
subclass of: Restriction
  min cardinality: 0
  on property: indigenousPeopleAndLocalCommunityOrigin
subclass of: Restriction
  min cardinality: 0
  on property: collectedBeforeDate
subclass of: Restriction
  all values from: dateTime
  on property: collectionDate
subclass of: Restriction
  all values from: Country
  on property: countryOfCollection
subclass of: BiologicalPartOrigin
broad match: SEPIO_0000058
definition: Information on the origin of a natural part that composes the biological material.
in scheme: evorao
related match: NCIT C43581
related match: NCIT C87913

NucleicAcid
type: Class
title: Nucleic acid
subclass of: Restriction
  min cardinality: 0
  on property: tagSequence
subclass of: Restriction
  min cardinality: 0
  on property: identificationTechnique
subclass of: Restriction
  max cardinality: 1
  on property: biologicalMaterialOrigin
subclass of: Restriction
  min cardinality: 0
  on property: mutationObserved
subclass of: Restriction
  min cardinality: 1
  on property: titer
subclass of: Restriction
  max cardinality: 1
  on property: clonedNucleicAcid
subclass of: Restriction
  min cardinality: 1
  on property: sequence
subclass of: Restriction
  max cardinality: 1
  on property: sequencing
subclass of: Restriction
  min cardinality: 0
  on property: clonedIntoPlasmid
subclass of: Restriction
  min cardinality: 1
  on property: sequencing
subclass of: Restriction
  max cardinality: 1
  on property: tagSequence
subclass of: Restriction
  all values from: Data
  on property: genBankFileOfTheConstruct
subclass of: Restriction
  all values from: boolean
  on property: sequenceChecked
subclass of: Restriction
  min cardinality: 1
  on property: clonedNucleicAcid
subclass of: Restriction
  all values from: string
  on property: regionEncompassedInThisProduct
subclass of: Restriction
  max cardinality: 1
  on property: sequenceChecked
subclass of: Restriction
  min cardinality: 0
  on property: plasmidSelection
subclass of: Restriction
  all values from: ExpressionVector
  on property: clonedIntoPlasmid
subclass of: Restriction
  max cardinality: 1
  on property: titer
subclass of: Restriction
  all values from: string
  on property: titer
subclass of: Restriction
  all values from: TagSequence
  on property: tagSequence
subclass of: Restriction
  all values from: boolean
  on property: clonedNucleicAcid
subclass of: Restriction
  min cardinality: 0
  on property: observedMutations
subclass of: Restriction
  all values from: PlasmidSelection
  on property: plasmidSelection
subclass of: Restriction
  max cardinality: 1
  on property: clonedIntoPlasmid
subclass of: Restriction
  all values from: string
  on property: observedMutations
subclass of: Restriction
  min cardinality: 0
  on property: regionEncompassedInThisProduct
subclass of: Restriction
  max cardinality: 1
  on property: mutationObserved
subclass of: Restriction
  all values from: boolean
  on property: mutationObserved
subclass of: Restriction
  all values from: string
  on property: identificationTechnique
subclass of: Restriction
  max cardinality: 1
  on property: identificationTechnique
subclass of: Restriction
  all values from: Sequence
  on property: sequence
subclass of: Restriction
  max cardinality: 1
  on property: observedMutations
subclass of: Restriction
  min cardinality: 0
  on property: sequenceChecked
subclass of: Restriction
  min cardinality: 0
  on property: genBankFileOfTheConstruct
subclass of: Restriction
  max cardinality: 1
  on property: regionEncompassedInThisProduct
subclass of: Restriction
  min cardinality: 1
  on property: biologicalMaterialOrigin
subclass of: Restriction
  all values from: Datatype
    intersection of: string
    intersection of: Datatype
      one of: Not sequenced
      one of: Partly sequenced
      one of: Fully sequenced
  on property: sequencing
subclass of: Restriction
  all values from: BiologicalMaterialOrigin
  on property: biologicalMaterialOrigin
subclass of: Product
definition: Nucleic acid related to a pathogen. It can be extracted or synthetic.
in scheme: evorao
related match: MI_0318

Prion
type: Class
subclass of: Pathogen
definition: The prion as a biological material.
in scheme: evorao
related match: DOID 649
related match: http://snomed.info/id/84676004

Protein
type: Class
subclass of: Restriction
  all values from: string
  on property: domain
subclass of: Restriction
  max cardinality: 1
  on property: functionalAndTechnicalDescription
subclass of: Restriction
  all values from: TagSequence
  on property: tagSequence
subclass of: Restriction
  max cardinality: 1
  on property: domain
subclass of: Restriction
  min cardinality: 1
  on property: sequence
subclass of: Restriction
  all values from: PdbReference
  on property: relatedPdb
subclass of: Restriction
  max cardinality: 1
  on property: tagStatusOfTheSolubilizedProtein
subclass of: Restriction
  max cardinality: 1
  on property: proteinPurification
subclass of: Restriction
  min cardinality: 0
  on property: expressedAs
subclass of: Restriction
  min cardinality: 0
  on property: inclusionBodiesType
subclass of: Restriction
  all values from: string
  on property: functionalAndTechnicalDescription
subclass of: Restriction
  all values from: Datatype
    intersection of: string
    intersection of: Datatype
      one of: Functionally characterized
      one of: No functional characterization
  on property: functionalCharacterization
subclass of: Restriction
  max cardinality: 1
  on property: tagSequence
subclass of: Restriction
  max cardinality: 1
  on property: biologicalMaterialOrigin
subclass of: Restriction
  min cardinality: 0
  on property: functionalCharacterization
subclass of: Restriction
  all values from: Datatype
    intersection of: string
    intersection of: Datatype
      one of: Greater than 95 percent
      one of: Unpurified expression host lysate or partly purified protein
  on property: proteinPurification
subclass of: Restriction
  max cardinality: 1
  on property: functionalCharacterization
subclass of: Restriction
  all values from: SpecialFeature
  on property: specialFeature
subclass of: Restriction
  all values from: BiologicalMaterialOrigin
  on property: biologicalMaterialOrigin
subclass of: Restriction
  all values from: Datatype
    intersection of: string
    intersection of: Datatype
      one of: Enzymatic
      one of: Antigenic
  on property: typeOfFunctionalCharacterization
subclass of: Restriction
  min cardinality: 0
  on property: expressionSystem
subclass of: Restriction
  min cardinality: 1
  on property: biologicalMaterialOrigin
subclass of: Restriction
  min cardinality: 0
  on property: typeOfFunctionalCharacterization
subclass of: Restriction
  min cardinality: 0
  on property: proteinPurification
subclass of: Restriction
  min cardinality: 0
  on property: tagStatusOfTheSolubilizedProtein
subclass of: Restriction
  max cardinality: 1
  on property: expressedAs
subclass of: Restriction
  min cardinality: 0
  on property: tagSequence
subclass of: Restriction
  all values from: string
  on property: tagStatusOfTheSolubilizedProtein
subclass of: Restriction
  min cardinality: 0
  on property: specialFeature
subclass of: Restriction
  min cardinality: 0
  on property: domain
subclass of: Restriction
  all values from: Sequence
  on property: sequence
subclass of: Restriction
  max cardinality: 1
  on property: expressionSystem
subclass of: Restriction
  all values from: Datatype
    intersection of: string
    intersection of: Datatype
      one of: E. coli
      one of: Insect cells
      one of: Mammalian cells
  on property: expressionSystem
subclass of: Restriction
  max cardinality: 1
  on property: inclusionBodiesType
subclass of: Restriction
  min cardinality: 0
  on property: relatedPdb
subclass of: Restriction
  all values from: Datatype
    intersection of: string
    intersection of: Datatype
      one of: Denatured
      one of: Refolded
  on property: inclusionBodiesType
subclass of: Restriction
  min cardinality: 0
  on property: functionalAndTechnicalDescription
subclass of: Restriction
  all values from: Datatype
    intersection of: string
    intersection of: Datatype
      one of: Soluble
      one of: Inclusion bodies
  on property: expressedAs
subclass of: Product
definition: A protein as a derived product from a pathogen.
in scheme: evorao

Protozoan
type: Class
subclass of: Pathogen
definition: The protozoan as a biological material.
in scheme: evorao
related match: http://snomed.info/id/417396000
related match: http://snomed.info/id/95896000

Publication
type: Class
subclass of: Restriction
  all values from: string
  on property: abstract
subclass of: Restriction
  min cardinality: 1
  on property: authors
subclass of: Restriction
  min cardinality: 1
  on property: abstract
subclass of: Restriction
  min cardinality: 1
  on property: title
subclass of: Restriction
  max cardinality: 1
  on property: title
subclass of: Restriction
  all values from: string
  on property: title
subclass of: Restriction
  min cardinality: 1
  on property: doi
subclass of: Restriction
  max cardinality: 1
  on property: abstract
subclass of: Restriction
  min cardinality: 0
  on property: journal
subclass of: Restriction
  all values from: Journal
  on property: journal
subclass of: Restriction
  all values from: Doi
  on property: doi
subclass of: Restriction
  max cardinality: 1
  on property: journal
subclass of: Restriction
  max cardinality: 1
  on property: authors
subclass of: Restriction
  all values from: string
  on property: authors
subclass of: Resource
definition: A scientific publication.
in scheme: evorao

Service
type: Class
subclass of: Restriction
  min cardinality: 0
  on property: modelSpecies
subclass of: Restriction
  max cardinality: 1
  on property: modelSpecies
subclass of: Restriction
  min cardinality: 0
  on property: modelType
subclass of: Restriction
  max cardinality: 1
  on property: modelType
subclass of: Restriction
  all values from: string
  on property: modelType
subclass of: Restriction
  all values from: string
  on property: modelSpecies
subclass of: ProductOrService
definition: An intangible offering characterized by an activity, performance, or facilitation carried out by a provider to fulfill a user’s need.
in scheme: evorao
related match: NCIT C47920
related match: Product

SyntheticPartOrigin
type: Class
title: Synthetic part origin
subclass of: Restriction
  all values from: string
  on property: descriptionOfModificationsMadeFromTheReferenceSequences
subclass of: Restriction
  min cardinality: 0
  on property: descriptionOfModificationsMadeFromTheReferenceSequences
subclass of: Restriction
  max cardinality: 1
  on property: descriptionOfModificationsMadeFromTheReferenceSequences
subclass of: Restriction
  all values from: boolean
  on property: modificationsFromTheReferenceSequences
subclass of: Restriction
  min cardinality: 1
  on property: modificationsFromTheReferenceSequences
subclass of: Restriction
  max cardinality: 1
  on property: modificationsFromTheReferenceSequences
subclass of: BiologicalPartOrigin
definition: Information on the origin of a synthetic part that composes the biological material.
in scheme: evorao

Version
type: Class
subclass of: Restriction
  all values from: string
  on property: versionOf
subclass of: Restriction
  min cardinality: 1
  on property: version
subclass of: Restriction
  min cardinality: 1
  on property: versionOf
subclass of: Restriction
  max cardinality: 1
  on property: versionOf
subclass of: Restriction
  all values from: string
  on property: version
subclass of: Restriction
  all values from: Resource
  on property: resource
subclass of: Restriction
  min cardinality: 0
  on property: resource
subclass of: Restriction
  max cardinality: 1
  on property: version
subclass of: Resource
definition: Numeric code assigned to identify a particular historical version of a work (e.g. software or technical standards).
in scheme: evorao
note: It enables managing multiple versions as first-class nodes and linking each version to its subject via evorao:versionOf and to the using resource via evorao:version (e.g., as nodes in a graph database).
note: Represents a specific snapshot/release of a resource (e.g., a dataset).
related match: Q114469879

Video
type: Class
subclass of: File
broad match: MediaType
definition: Subclass of File representing moving visual media, such as recordings, presentations, or movies.
in scheme: evorao

Viroid
type: Class
subclass of: Pathogen
definition: The viroid as a biological material.
in scheme: evorao
related match: http://snomed.info/id/88117008

Virus
type: Class
subclass of: Restriction
  min cardinality: 0
  on property: mycoplasmicContent
subclass of: Restriction
  all values from: Datatype
    intersection of: string
    intersection of: Datatype
      one of: Not tested
      one of: Mycoplasma free
      one of: Contains mycoplasmae
      one of: Contains mycoplasmae - A protocol to remove mycoplasmae is provided
  on property: mycoplasmicContent
subclass of: Restriction
  min cardinality: 0
  on property: contaminationWithCoInfectingViruses
subclass of: Restriction
  max cardinality: 1
  on property: contaminationWithCoInfectingViruses
subclass of: Restriction
  all values from: VirusName
  on property: coInfectingViruses
subclass of: Restriction
  min cardinality: 0
  on property: coInfectingViruses
subclass of: Restriction
  all values from: Datatype
    intersection of: string
    intersection of: Datatype
      one of: Not tested
      one of: Contaminated
      one of: No contamination detected
  on property: contaminationWithCoInfectingViruses
subclass of: Restriction
  max cardinality: 1
  on property: mycoplasmicContent
subclass of: Pathogen
definition: The virus as a biological material.
in scheme: evorao
related match: DOID 934
related match: MONDO_0005108
related match: NCBITaxon_10239
related match: http://snomed.info/id/49872002

EVORAO
type: Ontology
contributor: Angatar
contributor: jamesamcl
contributor: https://orcid.org/0000-0002-1257-6862
contributor: https://orcid.org/0000-0002-2004-4073
contributor: https://orcid.org/0000-0002-2042-2839
contributor: https://orcid.org/0000-0002-2859-7123
contributor: https://orcid.org/0000-0002-5080-3456
contributor: https://orcid.org/0000-0002-6963-8673
contributor: https://orcid.org/0000-0002-8361-2795
contributor: https://orcid.org/0000-0003-3035-4195
contributor: 0000-0003-3067-827X
contributor: https://orcid.org/0000-0003-4073-7456
license: https://creativecommons.org/publicdomain/zero/1.0/
title: European Viral Outbreak Response Alliance Ontology
created by: Angatar
version: 1.1.44
language: en
keywords: biobank
keywords: biological collections
keywords: biological materials
keywords: biosample
keywords: diagnostic material
keywords: infectious diseases
keywords: interoperability
keywords: pandemic preparedness
keywords: pathogen
keywords: pathogen collections
keywords: reference material
keywords: viral resources
keywords: virology
keywords: virus
definition: The EVORAO Ontology provides a structured and harmonized vocabulary for describing shareable pathogens as characterized biological materials, along with their derived products and associated services, organized into collections. Developed within the EVORA project, it supports consistent metadata annotation across research infrastructures, promoting findability, accessibility, interoperability, and reusability (FAIR). By aligning with relevant standards and ontologies, EVORAO facilitates cross-domain collaboration, integration, and sharing of pathogenic resources and services to enhance pandemic preparedness and response. While initially focused on virology, EVORAO is designed to be extensible and also supports metadata harmonization for other pathogens. EVORAO is compatible with DCAT, making it well-suited for efficiently cataloguing pathogen collections and related resources.
note: EVORAO is an ontology for standardized metadata supporting the sharing of pathogens as biological materials, their derived products, and associated services, organized into collections. While initially focused on virology, it is designed for interoperability and is extensible to other pathogens. EVORAO is compatible with DCAT, making it well-suited for efficiently cataloguing pathogen collections and related resources.

DataService
type: Class
title: Data Service
subclass of: Restriction
  max cardinality: 1
  on property: endpointUrl
subclass of: Restriction
  all values from: Dataset
  on property: servesDataset
subclass of: Restriction
  all values from: string
  on property: description
subclass of: Restriction
  min cardinality: 0
  on property: servesDataset
subclass of: Restriction
  max cardinality: 1
  on property: description
subclass of: Restriction
  min cardinality: 1
  on property: title
subclass of: Restriction
  all values from: anyURI
  on property: endpointUrl
subclass of: Restriction
  min cardinality: 1
  on property: endpointUrl
subclass of: Restriction
  min cardinality: 0
  on property: description
subclass of: Restriction
  all values from: string
  on property: title
subclass of: Restriction
  max cardinality: 1
  on property: title
subclass of: Resource
definition: A collection of operations that provides access to one or more datasets or data processing functions.
in scheme: evorao

Antibody
type: Class
subclass of: Restriction
  max cardinality: 1
  on property: antibodySpecificity
subclass of: Restriction
  max cardinality: 1
  on property: antibodyType
subclass of: Restriction
  all values from: Datatype
    intersection of: string
    intersection of: Datatype
      one of: Monoclonal
      one of: Polyclonal
      one of: Serum
  on property: antibodyType
subclass of: Restriction
  min cardinality: 0
  on property: antibodyPurifiedByAffinity
subclass of: Restriction
  max cardinality: 1
  on property: productionSystem
subclass of: Restriction
  all values from: string
  on property: productionSystem
subclass of: Restriction
  min cardinality: 0
  on property: specificityDocumented
subclass of: Restriction
  min cardinality: 0
  on property: sequenceReference
subclass of: Restriction
  min cardinality: 1
  on property: targetedAntigen
subclass of: Restriction
  all values from: string
  on property: antibodySpecificity
subclass of: Restriction
  all values from: boolean
  on property: antibodyPurifiedByAffinity
subclass of: Restriction
  all values from: SequenceReference
  on property: sequenceReference
subclass of: Restriction
  min cardinality: 0
  on property: antibodyType
subclass of: Restriction
  all values from: Datatype
    intersection of: string
    intersection of: Datatype
      one of: Western blot
      one of: ELISA
      one of: IFA
      one of: Neutralisation
      one of: Immunoprecipitation
      one of: Biophysical method
  on property: antibodyCharacterizationMethod
subclass of: Restriction
  min cardinality: 0
  on property: antibodyCharacterizationMethod
subclass of: Restriction
  min cardinality: 0
  on property: antibodyCharacterizationObservation
subclass of: Restriction
  max cardinality: 1
  on property: antibodyPurifiedByAffinity
subclass of: Restriction
  all values from: boolean
  on property: specificityDocumented
subclass of: Restriction
  max cardinality: 1
  on property: antibodyCharacterizationObservation
subclass of: Restriction
  max cardinality: 1
  on property: targetedAntigen
subclass of: Restriction
  min cardinality: 0
  on property: productionSystem
subclass of: Restriction
  all values from: string
  on property: targetedAntigen
subclass of: Restriction
  min cardinality: 0
  on property: antibodySpecificity
subclass of: Restriction
  all values from: string
  on property: antibodyCharacterizationObservation
subclass of: Restriction
  max cardinality: 1
  on property: specificityDocumented
subclass of: Product
definition: Protein that can bind to certain types of foreign bodies, such as pathogens.
in scheme: evorao

BiosafetyLevel
type: Class
title: Biosafety level
subclass of: Term
broad match: NCIT C95347
definition: The level of biocontainment required or applied in the facility where the biological agent is manipulated.
in scheme: evorao
note: The Biosafety Level (BSL) reflects the operational safety measures implemented, which may differ from the intrinsic risk defined by the agent’s Risk Group (RG).
note: Using a dedicated data provider for BSL instances is recommended. Definitions of existing Biosafety Levels can also be found at wd:Q18396533, wd:Q18396535, wd:Q18396538, and wd:Q18396539.
related match: Q18396533
related match: Q18396535
related match: Q18396538
related match: Q18396539

Certification
type: Class
subclass of: Restriction
  max cardinality: 1
  on property: title
subclass of: Restriction
  max cardinality: 1
  on property: resourceUrl
subclass of: Restriction
  all values from: Document
  on property: certificationDocument
subclass of: Restriction
  min cardinality: 0
  on property: resourceUrl
subclass of: Restriction
  all values from: string
  on property: title
subclass of: Restriction
  all values from: Image
  on property: logo
subclass of: Restriction
  min cardinality: 0
  on property: description
subclass of: Restriction
  min cardinality: 0
  on property: logo
subclass of: Restriction
  min cardinality: 0
  on property: certificationDocument
subclass of: Restriction
  max cardinality: 1
  on property: description
subclass of: Restriction
  all values from: anyURI
  on property: resourceUrl
subclass of: Restriction
  all values from: string
  on property: description
subclass of: Restriction
  max cardinality: 1
  on property: logo
subclass of: Restriction
  min cardinality: 1
  on property: title
subclass of: Resource
definition: Assurance given by an independent certification body that a product, service or system meets the requirements of a standard.
in scheme: evorao
related match: NCIT C43610

Collection
type: Class
subclass of: Restriction
  all values from: DataProvider
  on property: collectionDataProvider
subclass of: Restriction
  all values from: ProductOrService
  on property: collectionItem
subclass of: Restriction
  min cardinality: 0
  on property: collectionItem
subclass of: Restriction
  max cardinality: 1
  on property: collectionDataProvider
subclass of: Restriction
  min cardinality: 0
  on property: collectionDataProvider
subclass of: Catalogue
definition: Set of products and services with some common characteristics.
in scheme: evorao

Data
type: Class
subclass of: File
broad match: MediaType
definition: Subclass of File representing structured or unstructured datasets, often used for analysis, storage, or transfer of information.
in scheme: evorao

ExpressionVector
type: Class
title: Expression vector
subclass of: Term
definition: A reference to an expression vector plasmid, typically embedding a resistance marker for inducible protein expression.
in scheme: evorao
related match: OBI_0600063
related match: ExpressionSystem

ExternalRelatedReference
type: Class
title: External related reference
subclass of: Restriction
  min cardinality: 1
  on property: referenceLabel
subclass of: Restriction
  all values from: string
  on property: reference
subclass of: Restriction
  all values from: string
  on property: referenceProviderPrefix
subclass of: Restriction
  max cardinality: 1
  on property: referenceLabel
subclass of: Restriction
  max cardinality: 1
  on property: referenceProviderName
subclass of: Restriction
  max cardinality: 1
  on property: referenceProviderPrefix
subclass of: Restriction
  all values from: string
  on property: referenceProviderName
subclass of: Restriction
  min cardinality: 1
  on property: referenceProviderPrefix
subclass of: Restriction
  all values from: string
  on property: referenceLabel
subclass of: Restriction
  min cardinality: 1
  on property: reference
subclass of: Restriction
  min cardinality: 1
  on property: referenceProviderName
subclass of: Restriction
  max cardinality: 1
  on property: reference
subclass of: Resource
definition: A reference that permits to retrieve an item from an external provider.
in scheme: evorao

FundingSource
type: Class
title: Funding source
subclass of: Restriction
  min cardinality: 0
  on property: fundingPeriodEnd
subclass of: Restriction
  max cardinality: 1
  on property: fundingPeriodStart
subclass of: Restriction
  max cardinality: 1
  on property: logo
subclass of: Restriction
  max cardinality: 1
  on property: eligibilityCriteria
subclass of: Restriction
  all values from: string
  on property: grantNumber
subclass of: Restriction
  max cardinality: 1
  on property: funder
subclass of: Restriction
  min cardinality: 0
  on property: description
subclass of: Restriction
  all values from: string
  on property: fundingProgram
subclass of: Restriction
  min cardinality: 0
  on property: fundingProgram
subclass of: Restriction
  min cardinality: 1
  on property: title
subclass of: Restriction
  all values from: string
  on property: description
subclass of: Restriction
  all values from: Organization
  on property: funder
subclass of: Restriction
  all values from: date
  on property: fundingPeriodStart
subclass of: Restriction
  min cardinality: 0
  on property: eligibilityCriteria
subclass of: Restriction
  min cardinality: 0
  on property: logo
subclass of: Restriction
  max cardinality: 1
  on property: description
subclass of: Restriction
  all values from: Image
  on property: logo
subclass of: Restriction
  min cardinality: 0
  on property: grantNumber
subclass of: Restriction
  all values from: date
  on property: fundingPeriodEnd
subclass of: Restriction
  all values from: string
  on property: eligibilityCriteria
subclass of: Restriction
  all values from: string
  on property: title
subclass of: Restriction
  min cardinality: 0
  on property: fundingPeriodStart
subclass of: Restriction
  max cardinality: 1
  on property: fundingProgram
subclass of: Restriction
  max cardinality: 1
  on property: fundingPeriodEnd
subclass of: Restriction
  max cardinality: 1
  on property: title
subclass of: Restriction
  max cardinality: 1
  on property: grantNumber
subclass of: Restriction
  min cardinality: 0
  on property: funder
subclass of: Resource
definition: A program, grant, or project providing financial support for the access or use of a product or service, either fully or partially.
in scheme: evorao

IataClassification
type: Class
title: IATA classification
subclass of: Term
definition: The corresponding International Air Transport Association (IATA)'s category for dangerous goods that are transported by air.
in scheme: evorao
related match: Q19755

IplcOrigin
type: Class
title: IPLC origin
subclass of: GeographicalOrigin
definition: The IPLC area (Indigenous People and Local Communities) from which a physical item originates.
in scheme: evorao
related match: Location

IsolationHost
type: Class
title: Isolation host
subclass of: Term
definition: Host organism from which the pathogen was isolated.
in scheme: evorao

Journal
type: Class
subclass of: Term
definition: Periodical journal publishing scientific research.
in scheme: evorao

Keyword
type: Class
subclass of: Term
definition: A term or phrase used to tag and categorize content.
in scheme: evorao

MaterialSafetyDataSheet
type: Class
title: Material safety data sheet
subclass of: Restriction
  min cardinality: 0
  on property: toxicologicalInformation
subclass of: Restriction
  max cardinality: 1
  on property: exposureControlsPersonalProtection
subclass of: Restriction
  all values from: string
  on property: firstAidMeasures
subclass of: Restriction
  max cardinality: 1
  on property: physicalChemicalProperties
subclass of: Restriction
  max cardinality: 1
  on property: hazardsIdentification
subclass of: Restriction
  max cardinality: 1
  on property: furtherInformation
subclass of: Restriction
  all values from: string
  on property: ecologicalInformation
subclass of: Restriction
  min cardinality: 0
  on property: exposureControlsPersonalProtection
subclass of: Restriction
  max cardinality: 1
  on property: accidentalReleaseMeasures
subclass of: Restriction
  min cardinality: 0
  on property: stabilityAndReactivity
subclass of: Restriction
  all values from: string
  on property: regulatoryInformation
subclass of: Restriction
  all values from: string
  on property: fireFightingMeasures
subclass of: Restriction
  all values from: string
  on property: stabilityAndReactivity
subclass of: Restriction
  max cardinality: 1
  on property: regulatoryInformation
subclass of: Restriction
  min cardinality: 0
  on property: furtherInformation
subclass of: Restriction
  min cardinality: 0
  on property: hazardsIdentification
subclass of: Restriction
  min cardinality: 0
  on property: handlingAndStorage
subclass of: Restriction
  max cardinality: 1
  on property: ecologicalInformation
subclass of: Restriction
  all values from: string
  on property: transportInformation
subclass of: Restriction
  all values from: string
  on property: disposalConsiderations
subclass of: Restriction
  all values from: string
  on property: handlingAndStorage
subclass of: Restriction
  max cardinality: 1
  on property: materialSafetyContact
subclass of: Restriction
  min cardinality: 0
  on property: regulatoryInformation
subclass of: Restriction
  min cardinality: 1
  on property: materialSafetyContact
subclass of: Restriction
  min cardinality: 0
  on property: physicalChemicalProperties
subclass of: Restriction
  max cardinality: 1
  on property: fireFightingMeasures
subclass of: Restriction
  min cardinality: 0
  on property: transportInformation
subclass of: Restriction
  min cardinality: 0
  on property: fireFightingMeasures
subclass of: Restriction
  min cardinality: 0
  on property: ecologicalInformation
subclass of: Restriction
  min cardinality: 0
  on property: accidentalReleaseMeasures
subclass of: Restriction
  max cardinality: 1
  on property: disposalConsiderations
subclass of: Restriction
  max cardinality: 1
  on property: toxicologicalInformation
subclass of: Restriction
  max cardinality: 1
  on property: firstAidMeasures
subclass of: Restriction
  min cardinality: 0
  on property: disposalConsiderations
subclass of: Restriction
  max cardinality: 1
  on property: handlingAndStorage
subclass of: Restriction
  all values from: string
  on property: toxicologicalInformation
subclass of: Restriction
  all values from: ContactPoint
  on property: materialSafetyContact
subclass of: Restriction
  all values from: string
  on property: furtherInformation
subclass of: Restriction
  min cardinality: 0
  on property: firstAidMeasures
subclass of: Restriction
  max cardinality: 1
  on property: transportInformation
subclass of: Restriction
  all values from: string
  on property: physicalChemicalProperties
subclass of: Restriction
  max cardinality: 1
  on property: stabilityAndReactivity
subclass of: Restriction
  all values from: string
  on property: exposureControlsPersonalProtection
subclass of: Restriction
  all values from: string
  on property: hazardsIdentification
subclass of: Restriction
  all values from: string
  on property: accidentalReleaseMeasures
subclass of: Resource
definition: A Material Safety Data Sheet (MSDS) or Safety Data Sheet (SDS) is a standardized document that contains crucial occupational safety and health information related to the product.
in scheme: evorao

Originator
type: Class
subclass of: PersonOrOrganization
definition: The individual or organization responsible for the original discovery, isolation, or creation of an item, providing information about the source or origin of the sample.
in scheme: evorao
related match: PersonOrOrganization
related match: Organization

PathogenIdentification
type: Class
title: Pathogen identification
subclass of: Restriction
  all values from: string
  on property: genotype
subclass of: Restriction
  max cardinality: 1
  on property: strain
subclass of: Restriction
  max cardinality: 1
  on property: taxon
subclass of: Restriction
  min cardinality: 0
  on property: serotype
subclass of: Restriction
  max cardinality: 1
  on property: genotype
subclass of: Restriction
  max cardinality: 1
  on property: isolate
subclass of: Restriction
  all values from: string
  on property: strain
subclass of: Restriction
  max cardinality: 1
  on property: pathogenName
subclass of: Restriction
  all values from: string
  on property: subspecies
subclass of: Restriction
  max cardinality: 1
  on property: serotype
subclass of: Restriction
  min cardinality: 0
  on property: genotype
subclass of: Restriction
  min cardinality: 1
  on property: taxon
subclass of: Restriction
  min cardinality: 0
  on property: variant
subclass of: Restriction
  max cardinality: 1
  on property: pathogenType
subclass of: Restriction
  all values from: string
  on property: serotype
subclass of: Restriction
  all values from: string
  on property: isolate
subclass of: Restriction
  min cardinality: 0
  on property: subspecies
subclass of: Restriction
  all values from: Variant
  on property: variant
subclass of: Restriction
  min cardinality: 1
  on property: pathogenType
subclass of: Restriction
  max cardinality: 1
  on property: subspecies
subclass of: Restriction
  min cardinality: 0
  on property: isolate
subclass of: Restriction
  max cardinality: 1
  on property: variant
subclass of: Restriction
  min cardinality: 1
  on property: pathogenName
subclass of: Restriction
  all values from: Datatype
    intersection of: string
    intersection of: Datatype
      one of: Virus
      one of: Bacterium
      one of: Fungus
      one of: Protozoan
      one of: Viroid
      one of: Prion
  on property: pathogenType
subclass of: Restriction
  min cardinality: 0
  on property: strain
subclass of: Restriction
  all values from: Taxon
  on property: taxon
subclass of: Restriction
  all values from: CommonName
  on property: pathogenName
subclass of: Restriction
  all values from: Datatype
    intersection of: string
    intersection of: Datatype
      one of: Animal
      one of: Human
      one of: Plant
  on property: hostType
subclass of: Restriction
  min cardinality: 0
  on property: hostType
subclass of: Resource
broad match: Identification
definition: A collection of distinguishing information that enables the differentiation of a pathogen from another.
in scheme: evorao

PdbReference
type: Class
title: PDB reference
subclass of: Term
definition: Identifier for 3D structural data as per the PDB (Protein Data Bank) database.
in scheme: evorao
related match: Q42415644
related match: P638

PlasmidSelection
type: Class
title: Plasmid selection
subclass of: Term
definition: The process of identifying cells that have successfully incorporated a plasmid, typically using antibiotic resistance markers.
in scheme: evorao
related match: OBI_0000729

ProductionCellLine
type: Class
title: Production cell line
subclass of: Term
definition: A population of cells that originates from a primary culture, adapted to grow and divide under laboratory conditions. Used in biotechnology to consistently produce biological substances.
in scheme: evorao
related match: CLO_0000031
related match: NCIT C16403

PropagationHost
type: Class
title: Propagation host
subclass of: Term
definition: The organism used to grow and multiply the pathogen under controlled conditions.
in scheme: evorao
related match: SIO_010415

Provider
type: Class
subclass of: Restriction
  all values from: ResearchInfrastructure
  on property: memberOfRi
subclass of: Restriction
  min cardinality: 0
  on property: memberOfRi
subclass of: Organization
definition: A provider of products or services, as a specific organization.
in scheme: evorao
related match: ProvenanceStatement
related match: Organization

RecombinantPartIdentification
type: Class
title: Recombinant part identification
subclass of: Restriction
  min cardinality: 1
  on property: sequence
subclass of: Restriction
  all values from: Sequence
  on property: sequence
subclass of: Restriction
  max cardinality: 1
  on property: partIdentification
subclass of: Restriction
  all values from: string
  on property: partIdentification
subclass of: Restriction
  min cardinality: 1
  on property: partIdentification
subclass of: Resource
definition: Identification of a recombinant part.
in scheme: evorao

ResearchInfrastructure
type: Class
title: Research infrastructure
subclass of: Organization
definition: A research infrastructure (RI).
in scheme: evorao
related match: NCIT C19158
related match: Organization

RiskGroup
type: Class
title: Risk group
subclass of: Term
broad match: NCIT C95347
definition: Risk group classification guides initial handling of biological agents in labs but doesn't systematically equate to biosafety levels. Actual risk varies with the agent, procedures, and personnel competence.
in scheme: evorao
note: The Risk Group (RG) assignments to an item are jurisdiction-dependent and may differ between countries/regions and by material form (e.g., live isolate, inactivated preparation, nucleic acid). Assignments can also change over time. We store here a single reference assignment; users must verify the current, locally applicable assignment with their competent authority.
note: Using a dedicated data provider for Risk Group instances is recommended. Definitions of existing Risk Groups can also be found at wd:Q125449389, wd:Q125449412, wd:Q125449429, and wd:Q125449439.
related match: Q125449389
related match: Q125449412
related match: Q125449429
related match: Q125449439

SpecialFeature
type: Class
title: Special feature
subclass of: Term
definition: Distinctive attributes of a product that set it apart from other similar items e.g., Reference strain, Vaccinal strain, Antiviral resistant strain ...
in scheme: evorao
note: These special features help researchers and professionals in the field to select appropriate virus strains for their specific research needs and applications.
related match: NCIT C73619

TransmissionMethod
type: Class
title: Transmission method
subclass of: Term
definition: The process by which the pathogen spreads between hosts.
in scheme: evorao
related match: NCIT C17214

Variant
type: Class
subclass of: CommonName
definition: An organism with one or more new mutations is referred to as a “variant” of the original organism if not sufficiently different to be termed a distinct strain.
in scheme: evorao

VirusName
type: Class
title: Virus name
subclass of: CommonName
broad match: vernacularName
definition: A virus vernacular name or a name that describes a group of viruses.
in scheme: evorao

Vocabulary
type: Class
subclass of: Restriction
  all values from: Term
  on property: term
subclass of: Restriction
  max cardinality: 1
  on property: termDataProvider
subclass of: Restriction
  all values from: DataProvider
  on property: termDataProvider
subclass of: Restriction
  min cardinality: 0
  on property: termDataProvider
subclass of: Restriction
  min cardinality: 0
  on property: term
subclass of: Catalogue
broad match: Collection
definition: A subset of words or phrases specific to a particular subject or field.
in scheme: evorao
related match: T4FS_0000335
related match: Q6499736

additionalCategory
type: ObjectProperty
title: additional category
range: ProductCategory
sub property of: category
definition: Any category apart from its main category in which this product or service can fit.
in scheme: evorao

antibodyCharacterizationMethod
type: DatatypeProperty
title: antibody characterization method
range: Datatype
  intersection of: string
  intersection of: Datatype
    one of: Western blot
    one of: ELISA
    one of: IFA
    one of: Neutralisation
    one of: Immunoprecipitation
    one of: Biophysical method
definition: A method used to determine the specificity, affinity, or functionality of an antibody or antiserum.
in scheme: evorao

biologicalPartOrigin
type: ObjectProperty
title: biological part origin
range: BiologicalPartOrigin
definition: Details the origin of one or more unitary parts that make up the biological material. In the case of recombinant biological material, multiple parts may be involved.
in scheme: evorao
note: It can be multiple parts in case of a recombinant biological material.
related match: hasBioChemEntityPart

certification
type: ObjectProperty
range: Certification
definition: Any certification related to the current product or service; e.g., ISO certification.
in scheme: evorao

certificationDocument
type: ObjectProperty
title: certification document
range: Document
definition: The document(s) issued by an authority certifying the conformity of the subject to the applicable scheme, including, as the case may be, the documents attesting the equivalence to another certification scheme.
in scheme: evorao

coInfectingViruses
type: ObjectProperty
title: co-infecting viruses
range: VirusName
definition: Identifies other viruses that may co-infect the host organism along with the primary virus, indicating the presence of multiple viral infections within the same host.
in scheme: evorao
related match: D060085
related match: EFO_0010716

collection
type: ObjectProperty
range: Collection
broad match: isPartOf
definition: The collection(s) to which belongs this item.
in scheme: evorao
related match: AFX_0002720

collectionItem
type: ObjectProperty
title: collection item
range: ProductOrService
broad match: includesObject
broad match: dataset
definition: An item of the collection.
in scheme: evorao
related match: resource
related match: servesDataset

complementaryDocument
type: ObjectProperty
title: complementary document
range: Document
definition: Any additional documents that provide supplementary information, instructions, or guidelines relevant to the use of this item.
in scheme: evorao

externalEquivalentTaxon
type: ObjectProperty
title: external equivalent taxon
range: Taxon
definition: Any equivalent taxon in a different taxonomy if exists/known to serve as a bridge (e.g, ICTV towards NCBI).
in scheme: evorao
note: Could serve as a bridge between ICTV and NCBI as several providers currently uses NCBI Taxonomy.
related match: references

externalRelatedReference
type: ObjectProperty
title: external related reference
range: ExternalRelatedReference
broad match: references
definition: A reference that permits to retrieve another related item from an external provider.
in scheme: evorao

fundingSource
type: ObjectProperty
title: funding source
range: FundingSource
definition: A program, grant, or project providing financial support for the access or use of the product or service, either fully or partially.
in scheme: evorao
note: Links a product or service to one or more financial mechanisms, initiatives, or grants that enable or support its provision or access.

genBankFileOfTheConstruct
type: ObjectProperty
title: GenBank file of the construct
range: Data
definition: A GenBank formatted file that contains detailed sequence and annotation information of a nucleic acid construct.
in scheme: evorao

hostType
type: DatatypeProperty
title: host type
range: Datatype
  intersection of: string
  intersection of: Datatype
    one of: Animal
    one of: Human
    one of: Plant
definition: Indication of the possible host(s) for the identified pathogens among the listed main categories.
in scheme: evorao

isolationHost
type: ObjectProperty
title: isolation host
range: IsolationHost
definition: The host organism from which the pathogen was originally isolated.
in scheme: evorao

itemsOfTheBundle
type: ObjectProperty
title: items of the bundle
range: ProductOrService
definition: Specifies the constituent products and/or services that are part of the bundle.
in scheme: evorao

keywords
type: ObjectProperty
range: Keyword
definition: List of terms used to tag and categorize this Item.
in scheme: evorao

lineage
type: DatatypeProperty
range: string
definition: An ordered list of textual taxon names representing the taxonomic lineage of the current taxon, normally from the highest known ancestor to the immediate parent.
in scheme: evorao
note: This property is intended for display, indexing, and search optimisation purposes. It represents a denormalised view of the taxonomic lineage and is typically derived automatically from successive parentTaxon relations. It MUST NOT be considered authoritative for taxonomic reasoning. This property provides a flattened, display-oriented view of the lineage and does not replace the parentTaxon relation.

memberOfRi
type: ObjectProperty
title: member of RI
range: ResearchInfrastructure
broad match: memberOf
definition: The research infrastructure of which this organization is a member.
in scheme: evorao

pathogenIdentification
type: ObjectProperty
title: pathogen identification
range: PathogenIdentification
definition: The identification of the pathogen or group of pathogens (e.g; name, taxon identification, etc.) related to the current item.
in scheme: evorao
note: The pathogen identification contains information about name and taxon but in some cases(e.g: FAIRSHARING) there may have no direct pathogen related but simply a taxonomic information .... the default value should be the root of virology: Viruses.

plasmidSelection
type: ObjectProperty
title: plasmid selection
range: PlasmidSelection
definition: Specific selectable markers in the plasmid, such as antibiotic resistance genes, used to identify and maintain cells that contain the plasmid.
in scheme: evorao

previouslyKnownAs
type: ObjectProperty
title: previously known as
range: Taxon
broad match: Taxon
definition: Any historic version of this taxon having a different name.
in scheme: evorao
related match: alternateName

productPicture
type: ObjectProperty
title: product picture
range: Image
definition: A picture that can represent the item.
in scheme: evorao

productionCellLine
type: ObjectProperty
title: production cell line
range: ProductionCellLine
definition: The cell line used for the production or propagation of the pathogen, detailing the cellular environment employed in its cultivation and study.
in scheme: evorao

propagationHost
type: ObjectProperty
title: propagation host
range: PropagationHost
definition: The host organism that propagates the pathogen.
in scheme: evorao

providedEntityType
type: DatatypeProperty
title: provided entity type
range: anyURI
sub property of: iri
definition: Identifies the type of entity (ontology class) described by the response to a query. Values should be expressed as IRIs (e.g., from an ontology).
in scheme: evorao
note: This property defines what the response is about, independent of its serialization.
note: Values should be ontology class IRIs (e.g. https://w3id.org/evorao/Virus).
related match: servesDataset

relatedPdb
type: ObjectProperty
title: related PDB
range: PdbReference
definition: Identifier for 3D structural data as per the PDB (Protein Data Bank) database.
in scheme: evorao

resource
type: ObjectProperty
range: Resource
definition: Resource published or curated by a single agent.
in scheme: evorao

specialFeature
type: ObjectProperty
title: special feature
range: SpecialFeature
definition: Distinctive attributes of a product that set it apart from other similar items e.g., Reference strain, Vaccinal strain, Antiviral resistant strain ...
in scheme: evorao

standardOperatingProcedureFile
type: ObjectProperty
title: standard operating procedure file
range: File
definition: The related standard operating procedure file (SOP).
in scheme: evorao

suspectedEpidemiologicalOrigin
type: ObjectProperty
title: suspected epidemiological origin
range: GeographicalOrigin
definition: The potential geographical or environmental source from which the pathogen is believed to have originated or been transmitted.
in scheme: evorao
related match: spatial
related match: countryOfOrigin

term
type: ObjectProperty
range: Term
definition: The terms related to this vocabulary.
in scheme: evorao
related match: hasPart

transmissionMethod
type: ObjectProperty
title: transmission method
range: TransmissionMethod
definition: The method or route through which the pathogen is transmitted from one host to another, detailing the mechanisms of infection spread.
in scheme: evorao

typeOfFunctionalCharacterization
type: DatatypeProperty
title: type of functional Characterization
range: Datatype
  intersection of: string
  intersection of: Datatype
    one of: Enzymatic
    one of: Antigenic
definition: Refers to the classification of a protein based on the specific type of functional analysis performed to determine its biological activities and roles. Possible values include 'Enzymatic' (the protein has been characterized for its enzyme activity) and 'Antigenic' (the protein has been characterized for its ability to elicit an immune response).
in scheme: evorao

dateIssued
type: DatatypeProperty
title: date issued
range: dateTime
definition: Date of formal issuance (e.g., publication) of the resource.
in scheme: evorao
note: encoded using the relevant ISO 8601 Date and Time compliant string [DATETIME].

dateModified
type: DatatypeProperty
title: date modified
range: dateTime
definition: Most recent date on which the resource was changed, updated or modified.
in scheme: evorao
note: encoded using the relevant ISO 8601 Date and Time compliant string [DATETIME].

note
type: DatatypeProperty
range: string
definition: An aditional information as a textual comment.
in scheme: evorao

Catalogue
type: Class
subclass of: Dataset
definition: A curated collection of metadata about resources.
in scheme: evorao

endpointUrl
type: DatatypeProperty
title: endpoint URL
range: anyURI
sub property of: iri
definition: The URL template that allows to get the content.
in scheme: evorao

keyword
type: DatatypeProperty
range: string
definition: A keyword or tag describing the resource.
in scheme: evorao

homePage
type: DatatypeProperty
title: home page
range: anyURI
sub property of: iri
definition: A web page that serves as the main or introductory page.
in scheme: evorao

Doi
type: Class
title: DOI
subclass of: Term
definition: A unique string identifier assigned to a digital object, providing a permanent link for reliable citation and access. The Digital Object Identifier (DOI) is a persistent identifier that is an ISO standard.
in scheme: evorao

GeographicalOrigin
type: Class
title: Geographical origin
subclass of: Term
broad match: Location
definition: The specific location or region where a physical item, originates or is naturally found.
in scheme: evorao
note: geonames.org API is a service data provider to consider as suggested by DCAT-AP.
related match: countryOfOrigin

License
type: Class
subclass of: Restriction
  all values from: Image
  on property: logo
subclass of: Restriction
  all values from: string
  on property: description
subclass of: Restriction
  max cardinality: 1
  on property: description
subclass of: Restriction
  max cardinality: 1
  on property: resourceUrl
subclass of: Restriction
  max cardinality: 1
  on property: licensingOrAttribution
subclass of: Restriction
  min cardinality: 0
  on property: licensingOrAttribution
subclass of: Restriction
  all values from: anyURI
  on property: resourceUrl
subclass of: Restriction
  min cardinality: 0
  on property: logo
subclass of: Restriction
  max cardinality: 1
  on property: logo
subclass of: Restriction
  min cardinality: 0
  on property: description
subclass of: Restriction
  min cardinality: 1
  on property: title
subclass of: Restriction
  all values from: string
  on property: title
subclass of: Restriction
  min cardinality: 0
  on property: resourceUrl
subclass of: Restriction
  max cardinality: 1
  on property: title
subclass of: Restriction
  all values from: string
  on property: licensingOrAttribution
subclass of: Resource
definition: The legal terms and conditions under which the subject can be used, shared, or distributed, indicating any restrictions or permissions.
in scheme: evorao

SequenceReference
type: Class
title: Sequence reference
subclass of: Restriction
  all values from: string
  on property: accessionNumber
subclass of: Restriction
  max cardinality: 1
  on property: accessionNumber
subclass of: Restriction
  min cardinality: 1
  on property: accessionNumber
subclass of: Restriction
  min cardinality: 1
  on property: sequenceProvider
subclass of: Restriction
  all values from: Datatype
    intersection of: string
    intersection of: Datatype
      one of: ENA
      one of: GenBank
      one of: DDBJ
      one of: UniProt
  on property: sequenceProvider
subclass of: Restriction
  max cardinality: 1
  on property: sequenceProvider
subclass of: Resource
definition: A reference that permits to retrieve the sequence information from a sequence provider.
in scheme: evorao
note: A work on making it a subclass of External related reference might be consistent and beneficial for data structuration but special attention will have to be take to ensure it remains consistent with the actual the use cases for users.

TagSequence
type: Class
title: Tag sequence
subclass of: Term
definition: The name of the DNA coding sequence or corresponding peptide/protein sequence fused to a sequence of interest, used to facilitate experimental operations such as purification, detection, localization, tracking, solubility enhancement, or selection. Applicable to both proteins and nucleic acids.
in scheme: evorao
note: This class is used for controlled vocabulary terms (e.g., His Cterm, His Nterm, MBP, GST, Strep, FLAG-Tag, SUMO ...) and not the literal sequences.

TaxonomicRank
type: Class
title: Taxonomic rank
subclass of: Restriction
  all values from: Taxonomy
  on property: taxonomy
subclass of: Restriction
  min cardinality: 0
  on property: taxonomy
subclass of: Term
definition: The possible taxonomic ranks and their description.
in scheme: evorao
note: Use of Data provider recommended.
related match: taxonRank

Taxonomy
type: Class
subclass of: Restriction
  min cardinality: 1
  on property: version
subclass of: Restriction
  all values from: DataProvider
  on property: versionDataProvider
subclass of: Restriction
  min cardinality: 0
  on property: rankDataProvider
subclass of: Restriction
  max cardinality: 1
  on property: taxonDataProvider
subclass of: Restriction
  all values from: DataProvider
  on property: rankDataProvider
subclass of: Restriction
  min cardinality: 0
  on property: taxonDataProvider
subclass of: Restriction
  all values from: TaxonomicRank
  on property: rank
subclass of: Restriction
  max cardinality: 1
  on property: versionDataProvider
subclass of: Restriction
  min cardinality: 1
  on property: taxon
subclass of: Restriction
  min cardinality: 1
  on property: versionDataProvider
subclass of: Restriction
  max cardinality: 1
  on property: version
subclass of: Restriction
  all values from: Taxon
  on property: taxon
subclass of: Restriction
  max cardinality: 1
  on property: rankDataProvider
subclass of: Restriction
  all values from: DataProvider
  on property: taxonDataProvider
subclass of: Restriction
  min cardinality: 0
  on property: rank
subclass of: Restriction
  all values from: string
  on property: version
subclass of: Catalogue
broad match: Collection
definition: A structured representation of data about the classification and naming of biological organisms into groups according to shared characteristics.
in scheme: evorao
related match: Q8269924

abstract
type: DatatypeProperty
range: string
definition: Concise summary of the publication.
in scheme: evorao

accessPointUrl
type: DatatypeProperty
title: access point URL
range: anyURI
sub property of: iri
broad match: url
definition: The URL that permits to access to the product/service detailed description page on the provider's website and/or allows to place an order about it or at least describe the process to place an order/enquiry.
in scheme: evorao
related match: landingPage

accessToPhysicalGeneticResource
type: DatatypeProperty
title: access to physical genetic resource
range: boolean
definition: Indicate if the biological part was produced with access to a physical genetic resource.
in scheme: evorao

accessionNumber
type: DatatypeProperty
title: accession number
range: string
sub property of: identifier
broad match: identifier
definition: The sequence ID that permits to retrieve the sequence information from the sequence provider.
in scheme: evorao
narrow match: NCIT P102
related match: identifier

accidentalReleaseMeasures
type: DatatypeProperty
title: accidental release measures
range: string
definition: Guidelines for safely managing spills or leaks of the product, including containment, cleanup procedures, and precautions to prevent harm to people, property, and the environment.
in scheme: evorao
related match: Recommendation

addressCountry
type: ObjectProperty
title: address Country
range: Country
definition: The country as of ISO 3166.
in scheme: evorao

addressLocality
type: DatatypeProperty
title: locality/city
range: string
definition: The locality in which the street address is, and which is in the region. e.g, the city.
in scheme: evorao

addressRegion
type: DatatypeProperty
title: region
range: string
definition: The region in which the locality is, and which is in the country. For example, California or another appropriate first-level Administrative division.
in scheme: evorao

alpha2Code
type: DatatypeProperty
title: alpha 2 code
range: string
definition: Two-letter country codes from ISO 3166-1 alpha-2.
in scheme: evorao
related match: NCIT C54641
related match: OBIB_0000620

altText
type: DatatypeProperty
title: alt text
range: string
definition: An alternate text for the image, if the image cannot be displayed.
in scheme: evorao

antibodyCharacterizationObservation
type: DatatypeProperty
title: antibody characterization observation
range: string
definition: A statement summarizing observed characteristics, behaviors, or findings derived from the antibody characterization process.
in scheme: evorao

antibodyPurifiedByAffinity
type: DatatypeProperty
title: antibody purified by affinity
range: boolean
definition: Indicates whether or not if the antibody was purified by affinity.
in scheme: evorao

antibodySpecificity
type: DatatypeProperty
title: antibody specificity
range: string
definition: Information describing the molecular or antigenic specificity of the antibody, including its recognized target(s), cross-reactivity with related antigens, and any contextual information supporting its selectivity.
in scheme: evorao

antibodyType
type: DatatypeProperty
title: antibody type
range: Datatype
  intersection of: string
  intersection of: Datatype
    one of: Monoclonal
    one of: Polyclonal
    one of: Serum
definition: The specification of the class of antibody based on its production method or biological origin. Expected values are "Polyclonal", "Monoclonal" or "Serum"
in scheme: evorao
related match: BAO_0000503
related match: BAO_0000507

authors
type: DatatypeProperty
range: string
definition: The list of authors.
in scheme: evorao
related match: IAO_0000321
related match: SIO_001315

availability
type: DatatypeProperty
range: string
definition: The state or condition in which this item is accessible and ready for use or can be obtained.
in scheme: evorao
note: Possible availabilities may differ from a project to another.

biologicalSourceType
type: DatatypeProperty
title: biological source type
range: boolean
definition: Indicates whether the biological material includes any part originally collected from a natural source (true) or is composed exclusively of synthetic parts (false).
in scheme: evorao
note: It makes sense that only recombinant biological materials can have a mixed material origin! Mixed origin (natural + synthetic) is represented by EVORAO:recombinantMaterial = true and EVORAO:biologicalSourceType = true, together with both EVORAO:NaturalPartOrigin and EVORAO:SyntheticPartOrigin instances linked via EVORAO:biologicalPartOrigin

biosafetyLevel
type: ObjectProperty
title: biosafety level
range: BiosafetyLevel
definition: The level of biocontainment required or applied in the facility where the biological agent is manipulated.
in scheme: evorao
note: The Biosafety Level (BSL) reflects the operational safety measures implemented, which may differ from the intrinsic risk defined by the agent’s Risk Group (RG).

biosafetyRestrictions
type: DatatypeProperty
title: biosafety restrictions
range: string
definition: Information about guidelines and regulations designed to prevent the exposure to or release of potentially harmful biological agents. It thereby contributes to protecting people and the environment from biohazards while accessing this product or service.
in scheme: evorao
related match: BAO_0002826
related match: P12663
related match: P1604

canBeUsedToProduceGmo
type: DatatypeProperty
title: can be used to produce GMO
range: boolean
broad match: potentialUse
definition: Indicates if the current service or product can be used to produce GMO.
in scheme: evorao
note: It is recommended to have a value for this field, no value will be understood as unknown.
note: Set to TRUE if it can produce GMO.

clinicalInformation
type: DatatypeProperty
title: clinical information
range: string
definition: Details about the clinical aspects of the pathogen, including symptoms, severity, treatment protocols, and patient outcomes.
in scheme: evorao
related match: NCIT C25398

clonedIntoPlasmid
type: ObjectProperty
title: cloned into plasmid
range: ExpressionVector
definition: The plasmid into which the nucleic acid has been cloned.
in scheme: evorao

clonedNucleicAcid
type: DatatypeProperty
title: cloned nucleic acid
range: boolean
definition: Specification of the terms and parameters for transporting.
in scheme: evorao

collectedBeforeDate
type: DatatypeProperty
title: collected before date
range: boolean
definition: Set to TRUE if a proxy date for the collection date is used.
in scheme: evorao
related match: RO_0002089
related match: SEPIO_0000105

collectionDataProvider
type: ObjectProperty
title: collection data provider
range: DataProvider
broad match: isReferencedBy
definition: The provider of the data of the collection.
in scheme: evorao

collectionDate
type: DatatypeProperty
title: collection date
range: dateTime
broad match: date
definition: The date when the sample was collected in situ. If unknown/private, use a proxy date such as 'date received' and indicate this by setting to true the before date property.
in scheme: evorao
related match: OBIB_0000714

contaminationWithCoInfectingViruses
type: DatatypeProperty
title: contamination with co-infecting viruses
range: Datatype
  intersection of: string
  intersection of: Datatype
    one of: Not tested
    one of: Contaminated
    one of: No contamination detected
definition: Indicates whether the sample contains contamination with co-infecting viruses. Possible values are ‘Not tested’, ‘Contaminated’, and ‘No contamination detected’.
in scheme: evorao
note: When it can be assessed, it is recommended to indicate whether contamination with co-infecting viruses was detected or if the test was not performed.

contentType
type: DatatypeProperty
title: content type
range: string
definition: The content type of the response to queries. It specifies the serialization, file type, or media type used to convey the resource, typically expressed as a MIME type following IANA media type registrations.
in scheme: evorao
note: This property characterizes how the content is structured or encoded, independent of the entity type it represents.
note: Values should use MIME types (e.g. application/json, text/csv, text/tab-separated-values, text/x-fasta, application/vnd.genbank).

contentUrl
type: DatatypeProperty
title: content URL
range: anyURI
sub property of: iri
definition: The web address or location where the file content is stored and can be accessed or downloaded.
in scheme: evorao

country
type: ObjectProperty
range: Country
definition: The country of the organization.
in scheme: evorao

countryOfCollection
type: ObjectProperty
title: country of collection
range: Country
broad match: spatial
definition: The geographical location where the sample was collected in situ. Used for Nagoya/CBD; equivalent to 'country of origin'.
in scheme: evorao
related match: GENEPIO_0000118
related match: country

cultivability
type: DatatypeProperty
range: Datatype
  intersection of: string
  intersection of: Datatype
    one of: Cultivable
    one of: Uncultivable
    one of: Inactivated
definition: The ability of the pathogen to be cultivated or grown in laboratory conditions. Possible values are 'Cultivable pathogen', 'Uncultivable pathogen' or 'Inactivated pathogen'.
in scheme: evorao
note: Might also be related to a product sub-category that helps filtering.

descriptionOfModificationsMadeFromTheReferenceSequences
type: DatatypeProperty
title: description of modification(s) made from the reference sequence(s)
range: string
definition: List the modifications mades from the reference sequence if any.
in scheme: evorao
related match: modification

disposalConsiderations
type: DatatypeProperty
title: disposal considerations
range: string
definition: Guidance on the safe and environmentally responsible disposal of the product, including recommended disposal methods, regulatory requirements, and precautions to avoid harm to people and the environment during disposal.
in scheme: evorao

domain
type: DatatypeProperty
range: string
definition: A distinct structural and functional unit within the protein, often capable of independent folding and stability, which contributes to the protein's overall function.
in scheme: evorao

ecologicalInformation
type: DatatypeProperty
title: ecological information
range: string
definition: Details the potential environmental impact of the product, including its effects on ecosystems, persistence, degradability, bioaccumulation potential, and toxicity to aquatic and terrestrial organisms.
in scheme: evorao

eligibilityCriteria
type: DatatypeProperty
title: eligibility criteria
range: string
definition: Conditions under which individuals or organisations may benefit from the financial mechanism, including access rules, eligibility requirements, or geographical/institutional restrictions. May be expressed as text or as a link to a formal eligibility statement.
in scheme: evorao
note: Keep clear and user-friendly; provide a link if criteria are complex.

email
type: DatatypeProperty
range: string
definition: The email address.
in scheme: evorao

exposureControlsPersonalProtection
type: DatatypeProperty
title: exposure controls/personal protection
range: string
definition: Specifies measures to limit exposure to the product, including recommended engineering controls (e.g., ventilation) and personal protective equipment (PPE) such as gloves, masks, goggles, and clothing to ensure safe handling.
in scheme: evorao

expressedAs
type: DatatypeProperty
title: expressed as
range: Datatype
  intersection of: string
  intersection of: Datatype
    one of: Soluble
    one of: Inclusion bodies
definition: Refers to the form in which the protein is produced and manifested in a biological system. Possible values include 'Soluble' (proteins that are dissolved in the cellular or extracellular fluid) and 'Inclusion bodies' (aggregated proteins that are insoluble and form within the cell).
in scheme: evorao

expressionSystem
type: DatatypeProperty
title: expression system
range: Datatype
  intersection of: string
  intersection of: Datatype
    one of: E. coli
    one of: Insect cells
    one of: Mammalian cells
definition: The host organism or cellular environment used to produce a protein from a specific gene. Possible values include 'E. coli' (bacterial system), 'Insect cells' (using baculovirus vectors), and 'Mammalian cells' (mammalian cell lines).
in scheme: evorao

fireFightingMeasures
type: DatatypeProperty
title: fire fighting measures
range: string
definition: Guidance on how to safely extinguish a fire involving the product, including suitable extinguishing agents, special protective equipment for firefighters, and any specific hazards from combustion.
in scheme: evorao
related match: Recommendation

firstAidMeasures
type: DatatypeProperty
title: first aid measures
range: string
definition: Instructions on immediate actions to take in case of exposure to the product, including inhalation, ingestion, skin, or eye contact. This section outlines steps to minimize harm before medical help is available.
in scheme: evorao
related match: Recommendation

format
type: DatatypeProperty
range: string
definition: The file type or format that indicates how the data within the file is structured.
in scheme: evorao

functionalAndTechnicalDescription
type: DatatypeProperty
title: functional and technical description
range: string
definition: Detailed information about the specific biological functions, mechanisms of action, and technical attributes of a protein. This includes how the protein interacts within biological systems, its role in cellular processes, and any relevant technical details such as structure, activity, and interactions with other molecules.
in scheme: evorao

functionalCharacterization
type: DatatypeProperty
title: functional characterization
range: Datatype
  intersection of: string
  intersection of: Datatype
    one of: Functionally characterized
    one of: No functional characterization
definition: The process of determining and describing the specific biological activities and roles of a protein. Possible values include 'Functionally characterized' (the protein's functions have been identified and described) and 'No functional characterization' (the protein's functions have not been identified or described).
in scheme: evorao

funder
type: ObjectProperty
range: Organization
definition: The organization providing the financial support.
in scheme: evorao

fundingPeriodEnd
type: DatatypeProperty
title: funding period end
range: date
definition: The date on which the financial mechanism ceases to apply to the supported product or service.
in scheme: evorao

fundingPeriodStart
type: DatatypeProperty
title: funding period start
range: date
definition: The date from which the financial mechanism is active or applicable to the supported product or service.
in scheme: evorao

fundingProgram
type: DatatypeProperty
title: funding program
range: string
definition: Identifies the overarching financial framework, research initiative, or support mechanism that enables or contributes to the provision of a product or service. The value may correspond to a European funding framework (e.g. Horizon Europe), a specific research initiative (e.g. an EU project), or another public or private funding mechanism.
in scheme: evorao

furtherInformation
type: DatatypeProperty
title: further information
range: string
definition: Provides any additional details or clarifications not covered in other sections of the MSDS, such as references, supporting documents, or specific instructions for safe handling and use of the product.
in scheme: evorao

genomeSequencing
type: DatatypeProperty
title: genome sequencing
range: Datatype
  intersection of: string
  intersection of: Datatype
    one of: Complete genome
    one of: Complete coding sequence
    one of: Partial sequence
definition: The extent of the pathogen's genetic material that has been sequenced, with possible values including 'Complete genome' for the entire genome, 'Complete coding sequence' for all coding regions, and 'Partial sequence' for only a portion of the genetic material.
in scheme: evorao

genotype
type: DatatypeProperty
range: string
definition: Genotype information that identifies organisms that cluster in phylogenetic trees, thus different clusters are distinct genotypes.
in scheme: evorao

grantNumber
type: DatatypeProperty
title: grant number
range: string
sub property of: identifier
definition: A formal reference or agreement number assigned by the funding body.
in scheme: evorao

handlingAndStorage
type: DatatypeProperty
title: handling and storage
range: string
definition: Instructions on the safe handling practices and storage conditions for the product, including precautions to prevent accidents, degradation, or contamination, as well as recommended temperature, humidity, and container requirements.
in scheme: evorao

hazardsIdentification
type: DatatypeProperty
title: hazards identification
range: string
definition: Outlines the potential risks and dangers associated with handling the product, including its physical, chemical, and health hazards. This section provides information on toxicity, flammability, reactivity, and other relevant risks for safe use.
in scheme: evorao

hybridomaDescription
type: DatatypeProperty
title: hybridoma description
range: string
definition: The description of the hybridoma.
in scheme: evorao

iataClassification
type: ObjectProperty
title: IATA classification
range: IataClassification
definition: The corresponding International Air Transport Association (IATA)'s category for this Product.
in scheme: evorao

inVocabulary
type: ObjectProperty
title: in Vocabulary
range: Vocabulary
broad match: isPartOf
definition: Terms belong to a specific vocabulary.
in scheme: evorao
related match: isReferencedBy

inclusionBodiesType
type: DatatypeProperty
title: inclusion bodies type
range: Datatype
  intersection of: string
  intersection of: Datatype
    one of: Denatured
    one of: Refolded
definition: Refers to the state of aggregated proteins within a cell. Possible values include 'Denatured' (proteins are in an unfolded, inactive state) and 'Refolded' (proteins have been processed to regain their functional, active conformation).
in scheme: evorao

indigenousPeopleAndLocalCommunityOrigin
type: ObjectProperty
title: indigenous people and local community origin
range: IplcOrigin
definition: The specific IPLC area (Indigenous People and Local Communities) from which this sample/element was sampled, if relevant.
in scheme: evorao
related match: http://id.nlm.nih.gov/mesh/D000081034
related match: NCIT C41152

infectivity
type: DatatypeProperty
range: Datatype
  intersection of: string
  intersection of: Datatype
    one of: Infectivity tested
    one of: Infectivity tested and quantified
    one of: Non cultivable sample, infectivity cannot be tested
definition: Indicates the ability of the pathogen to establish an infection in a host organism, with possible values detailing whether infectivity has been tested, quantified, or cannot be tested due to non-cultivable nature.
in scheme: evorao

infectivityTest
type: DatatypeProperty
title: infectivity Test
range: string
definition: The description of the completed infectivity test, providing details on the methods, conditions, and results of the test used to assess the pathogen's ability to infect a host organism.
in scheme: evorao
related match: CIDO_0001195

internalReference
type: DatatypeProperty
title: internal reference
range: string
broad match: references
definition: Any reference or indication to be used for local retrieval purpose.
in scheme: evorao

isolate
type: DatatypeProperty
range: string
definition: Identifier given to a pathogen that has been isolated from an infected host and propagated in a laboratory culture. The isolate information may include an internal reference code from the laboratory that took the sample or performed the isolation, as well as details about the specific conditions of isolation, such as the name of the town, hospital, and type of host.
in scheme: evorao

isolationConditions
type: DatatypeProperty
title: isolation conditions
range: string
definition: The environmental and procedural conditions under which the pathogen was isolated.
in scheme: evorao

isolationTechnique
type: DatatypeProperty
title: isolation technique
range: string
definition: The specific method or procedure used to isolate the pathogen from a host organism or sample, detailing the techniques and tools employed in the isolation process.
in scheme: evorao

journal
type: ObjectProperty
range: Journal
definition: The scientific journal in which the publication was published.
in scheme: evorao

letterOfAuthority
type: DatatypeProperty
title: letter of authority
range: Datatype
  intersection of: string
  intersection of: Datatype
    one of: Not applicable
    one of: Not required
    one of: Required for customers in the EU
    one of: Required
definition: Indicate whether a Letter of Authority is required, confirming the necessity of formal authorization. The possible values are 'Not applicable', 'Not required', 'Required for customers in the EU' or 'Required'.
in scheme: evorao
note: When a letter of authority may be required, as is often the case for certain pathogens such as plant viruses, it is strongly recommended to indicate the status of this requirement, as this information may affect delivery conditions and is important for the end-user.

licensingOrAttribution
type: DatatypeProperty
title: licensing or attribution
range: string
definition: A text or html code that provides any related data sharing licence and/or attribution.
in scheme: evorao

loginRequestMethod
type: DatatypeProperty
title: login request method
range: Datatype
  intersection of: string
  intersection of: Datatype
    one of: GET
    one of: POST
broad match: httpMethod
definition: The http request method used to acces the login request url.
in scheme: evorao

loginTokenName
type: DatatypeProperty
title: login token name
range: string
definition: The name of the token, unique identifier of an interaction session, that will have to be reused as credential in the query.
in scheme: evorao

loginUrl
type: DatatypeProperty
title: login URL
range: anyURI
sub property of: iri
broad match: urlTemplate
definition: The URL template that allows to log in if required.
in scheme: evorao

materialSafetyContact
type: ObjectProperty
title: material safety contact
range: ContactPoint
sub property of: contactPoint
broad match: contactPoint
definition: The designated contact point responsible for providing information related to the safety, handling, and regulatory compliance of the biological product.
in scheme: evorao

materialSafetyDataSheet
type: ObjectProperty
title: material safety data sheet
range: MaterialSafetyDataSheet
definition: A Material Safety Data Sheet (MSDS) or Safety Data Sheet (SDS) is a standardized document that contains crucial occupational safety and health information related to the product.
in scheme: evorao
note: The MSD is a document that provides detailed information about the properties, hazards, handling, storage, and emergency procedures related to the use of a chemical or substance.

modelSpecies
type: DatatypeProperty
title: model species
range: string
definition: The species of the infected organism in the experiment.
in scheme: evorao

modelType
type: DatatypeProperty
title: model type
range: string
definition: The specific name of the infected organism, including its modification if necessary.
in scheme: evorao

modificationsFromTheReferenceSequences
type: DatatypeProperty
title: modifications from the reference sequence(s)
range: boolean
definition: Set to TRUE if there was is any modification made from the reference sequence.
in scheme: evorao
related match: GENO_0000967

mutationObserved
type: DatatypeProperty
title: mutation observed
range: boolean
definition: Indicates if the current nucleic acid has No mutation compared to the reference sequence if the value is set to false or if it contains mutations (no frameshift, no unexpected STOP codon) if set to true.
in scheme: evorao
note: Except for non-sequenced nucleic acids, for which mutations cannot be assessed, it is strongly recommended to determine whether any mutations are present in the provided sequenced nucleic acid.

mycoplasmicContent
type: DatatypeProperty
title: mycoplasmic content
range: Datatype
  intersection of: string
  intersection of: Datatype
    one of: Not tested
    one of: Mycoplasma free
    one of: Contains mycoplasmae
    one of: Contains mycoplasmae - A protocol to remove mycoplasmae is provided
definition: Indicates whether the sample contains mycoplasma contamination. The possible values are 'Not tested', 'Mycoplasma free', 'Contains mycoplasmae', 'Contains mycoplasmae - A protocol to remove mycoplasmae is provided'
in scheme: evorao
note: When it can be assessed, it is recommended to indicate whether mycoplasma contamination was detected or if the test was not performed.

observedMutations
type: DatatypeProperty
title: observed mutations
range: string
definition: The specific mutations that have been identified and documented in the nucleic acid sequence.
in scheme: evorao

originator
type: ObjectProperty
range: Originator
definition: The individual or organization responsible for the original discovery, isolation, or creation of an item, providing information about the source or origin of the sample.
in scheme: evorao

parentCategory
type: ObjectProperty
title: parent category
range: ProductCategory
broad match: isPartOf
definition: An overarching category that encompasses the current category within a hierarchical classification system. It serves as the top-level classification, organizing related subcategories under its umbrella to create a structured and logical order.
in scheme: evorao

parentTaxon
type: ObjectProperty
title: parent taxon
range: Taxon
broad match: Taxon
definition: The parent taxon of the current taxon.
in scheme: evorao

partIdentification
type: DatatypeProperty
title: Part identification
range: string
definition: A short designation of this recombinant part of the related biological material.
in scheme: evorao

passage
type: DatatypeProperty
range: string
definition: The number of times the pathogen was cultured through serial passage, a process used to increase the stock but which can also lead to the evolution of the original pathogen.
in scheme: evorao
related match: NCIT C164572

pathogenName
type: ObjectProperty
title: pathogen name
range: CommonName
definition: A pathogen common name or a name that describes a group of pathogens.
in scheme: evorao

pathogenType
type: DatatypeProperty
title: pathogen type
range: Datatype
  intersection of: string
  intersection of: Datatype
    one of: Virus
    one of: Bacterium
    one of: Fungus
    one of: Protozoan
    one of: Viroid
    one of: Prion
definition: Identification of the specific type of pathogen among the listed categories e.g. 'Virus','Viroid','Bacterium'...
in scheme: evorao

permitIdentifierForAbs
type: DatatypeProperty
title: permit identifier for ABS
definition: Reference of the permit identifiers for access to the genetic resource, applicable if the genetic resource falls under Access and Benefit-Sharing (ABS) regulations.
in scheme: evorao

physicalChemicalProperties
type: DatatypeProperty
title: physical and chemical properties and information on ingredients
range: string
definition: Key characteristics of the product, such as physical state, appearance, solubility, pH, chemical composition, and molecular weight, essential for safe handling and storage.
in scheme: evorao

postalCode
type: DatatypeProperty
title: postal code
range: string
definition: The postal code.
in scheme: evorao

preparationTechnique
type: DatatypeProperty
title: preparation technique
range: string
definition: The technique, method, or procedure employed to obtain or prepare the material prior to its use or storage.
in scheme: evorao

productionSystem
type: DatatypeProperty
title: production system
range: string
definition: The biological and technological methods and processes used to produce the antibody.
in scheme: evorao

proteinPurification
type: DatatypeProperty
title: protein purification
range: Datatype
  intersection of: string
  intersection of: Datatype
    one of: Greater than 95 percent
    one of: Unpurified expression host lysate or partly purified protein
definition: Refers to the degree of purity achieved for a protein sample. Possible values include '>95%' (the protein is highly purified, with more than 95% purity) and 'Unpurified expression host lysate or partly purified protein' (the protein is either unpurified and present in the host cell lysate or only partially purified).
in scheme: evorao

provider
type: ObjectProperty
range: Provider
definition: A provider of this product or service, as a specific organization.
in scheme: evorao

qualityGrading
type: DatatypeProperty
title: quality grading
range: string
definition: Information that permits to assess the quality level of what will be provided.
in scheme: evorao

queryMethod
type: DatatypeProperty
title: query method
range: Datatype
  intersection of: string
  intersection of: Datatype
    one of: GET
    one of: POST
broad match: httpMethod
definition: The http request method used to access the requested query url.
in scheme: evorao

rankDataProvider
type: ObjectProperty
title: rank data provider
range: DataProvider
definition: The data provider for the description of the taxonomic ranks used in this taxonomy.
in scheme: evorao

recombinantMaterial
type: DatatypeProperty
title: recombinant material
range: boolean
definition: Indicates if this biological material is a recombinant biological material.
in scheme: evorao

recombinantPartIdentification
type: ObjectProperty
title: recombinant part identification
range: RecombinantPartIdentification
definition: Identification of a recombinant part.
in scheme: evorao
note: Information not required if the current biological part constitutes the complete biological material.

refSku
type: DatatypeProperty
title: ref SKU
range: string
sub property of: identifier
broad match: identifier
definition: The reference or the stock keeping unit of the service or item provided in the provider's catalogue.
in scheme: evorao

reference
type: DatatypeProperty
range: string
sub property of: identifier
definition: The identifier reference of the connected external item.
in scheme: evorao

referenceLabel
type: DatatypeProperty
title: reference label
range: string
definition: The label informing what this reference is about.
in scheme: evorao
note: e.g., 'Infravec2 related product'.

referenceProviderName
type: DatatypeProperty
title: reference provider name
range: string
definition: The name for the reference provider.
in scheme: evorao

referenceProviderPrefix
type: DatatypeProperty
title: reference provider prefix
range: string
definition: The url prefix that once completed with the reference will lead to the linked external resource.
in scheme: evorao
related match: IAO_0000599
related match: landingPage

regionEncompassedInThisProduct
type: DatatypeProperty
title: region encompassed in this Product
range: string
definition: The specific region encompassed in the product.
in scheme: evorao
note: The regionEncompassedInThisProduct property is strongly recommended for cloned nucleic acids, as it provides essential information that greatly improves the clarity and precision of the description for the user.

regulatoryInformation
type: DatatypeProperty
title: regulatory information
range: string
definition: Lists applicable laws, regulations, and standards governing the product, including local, national, or international requirements for its handling, use, transportation, and disposal, ensuring compliance with legal obligations.
in scheme: evorao
related match: seeAlso

riskGroup
type: ObjectProperty
title: risk group
range: RiskGroup
definition: The highest risk group related to this resource. The risk group of a biological agent guiding its initial handling in labs according to the risk group classification defined by the WHO laboratory biosafety manual.
in scheme: evorao
note: The Risk Group (RG) assignments to an item are jurisdiction-dependent and may differ between countries/regions and by material form (e.g., live isolate, inactivated preparation, nucleic acid). Assignments can also change over time. We store here a single reference assignment; users must verify the current, locally applicable assignment with their competent authority.
related match: BAO_0002826

rorId
type: DatatypeProperty
title: ROR iD
range: string
sub property of: identifier
definition: The corresponding organization's persistent identifier from the Research Organization Registry (ROR).
in scheme: evorao
related match: institutionCode

sequenceChecked
type: DatatypeProperty
title: sequence checked
range: boolean
definition: Tell whether or not the sequence of the product was controlled, which is expected for sequenced nucleic acids and especially important for cloned ones.
in scheme: evorao
note: For non-sequenced nucleic acids, the sequenceChecked value cannot be assessed. In all other cases, it is strongly recommended to indicate whether the sequence verification has been performed or not. For cloned products in particular, providing this information is especially meaningful, as sequence verification is a key element in confirming the integrity of the cloned construct and is therefore expected to be documented whenever available.
related match: ICEO_0000336

sequenceFasta
type: DatatypeProperty
title: sequence FASTA
range: string
definition: Textual encoding of a biological sequence information in FASTA format.
in scheme: evorao
note: In FASTA format the line before the nucleotide sequence, called the FASTA definition line, must begin with a charater ('>'), followed by a unique SeqID (sequence identifier).
note: In cases where no reference sequence exists in public repositories, the corresponding FASTA sequence is expected; otherwise, the reference sequence is sufficient. In case the sequence is made of multiple parts several fasta sequences can be provided.

sequenceProvider
type: DatatypeProperty
title: sequence provider
range: Datatype
  intersection of: string
  intersection of: Datatype
    one of: ENA
    one of: GenBank
    one of: DDBJ
    one of: UniProt
definition: The name of the sequence provider within the list of accepted sequence providers.
in scheme: evorao

sequencing
type: DatatypeProperty
range: Datatype
  intersection of: string
  intersection of: Datatype
    one of: Not sequenced
    one of: Partly sequenced
    one of: Fully sequenced
definition: Refers to the level of sequencing performed on the nucleic acid. Possible values include 'Not sequenced' (no sequencing has been performed), 'Partly sequenced' (only a portion of the nucleic acid sequence has been determined), and 'Fully sequenced' (the entire nucleic acid sequence has been determined).
in scheme: evorao
note: Cloned products have to be sequenced.

serotype
type: DatatypeProperty
range: string
definition: Genetically related pathogens that group together based on serological relationships.
in scheme: evorao

shippingConditions
type: DatatypeProperty
title: shipping conditions
range: string
definition: Specification of the terms and parameters for transporting.
in scheme: evorao

specificity
type: DatatypeProperty
range: string
definition: Details on the ability of a detection kit to correctly identify negative results, distinguishing between the target analyte and other substances without cross-reacting.
in scheme: evorao

stabilityAndReactivity
type: DatatypeProperty
title: stability and reactivity
range: string
definition: Describes the product’s stability under normal conditions and its potential to react with other substances. This section includes information on hazardous reactions, conditions to avoid, and incompatible materials that could cause degradation or dangerous reactions.
in scheme: evorao

storageConditions
type: DatatypeProperty
title: storage conditions
range: string
definition: Specifies the conditions under which the product has to be stored to maintain stability and integrity, such as temperature, buffer, and other environmental factors.
in scheme: evorao
note: e.g, could be a xsd:string in enumeration ('Freeze Dried', 'Liquid Nitrogen', 'Viral Storage Medium -20C', 'Viral Storage Medium -80C', 'Living plant material (>= +4°C)', 'Gas Phase', 'Ethanol -20C', 'Ethanol -80C', 'Dried').

strain
type: DatatypeProperty
range: string
definition: Identifier given to a genetic variant within a single species.
in scheme: evorao

streetAddress
type: DatatypeProperty
title: street address
range: string
definition: The building/apartment number and the street name.
in scheme: evorao

subspecies
type: DatatypeProperty
range: string
definition: The subspecies information differentiates closely related pathogens within a single species.
in scheme: evorao

tagStatusOfTheSolubilizedProtein
type: DatatypeProperty
title: tag status of the solubilized protein
range: string
definition: Indicates the presence and condition of a tag on the protein after solubilization. Possible values include 'Uncleaved Tag' (the tag is still attached to the protein), 'Cleaved Tag' (the tag has been removed from the protein), and 'No Tag' (the protein does not have a tag).
in scheme: evorao

targetedAntigen
type: DatatypeProperty
title: targeted antigen
range: string
definition: Specific molecular structure or epitope recognized and bound by an antibody.
in scheme: evorao

targetedRegion
type: DatatypeProperty
title: targeted region
range: string
definition: The specific area or sequence within the target analyte that the detection kit is designed to identify and interact with, ensuring accurate detection and analysis.
in scheme: evorao

taxonDataProvider
type: ObjectProperty
title: taxon data provider
range: DataProvider
definition: The data provider for the taxons of the taxonomy.
in scheme: evorao

taxonomicId
type: DatatypeProperty
title: taxonomic ID
range: string
sub property of: identifier
broad match: identifier
definition: The taxonomic identifier as a persistent identifier accross releases.
in scheme: evorao
narrow match: NCIT P331

taxonomicNodeId
type: DatatypeProperty
title: taxonomic node ID
range: string
sub property of: identifier
broad match: identifier
definition: The taxonomic_Node Identifier as an identifier specific the current taxon in the corresponding release/version of the taxonomy.
in scheme: evorao
note: NCBI does not have a taxon_node id, only a taxonomicID. Taxon_node id is Unique in ICTV= Key of the taxon node!

technicalRecommendation
type: DatatypeProperty
title: technical recommendation
range: string
definition: Expert advice or guidelines provided to ensure the optimal use, performance, and maintenance of what is provided, including best practices, troubleshooting tips, and procedural instructions.
in scheme: evorao

telephone
type: DatatypeProperty
range: string
definition: The telephone number.
in scheme: evorao

termDataProvider
type: ObjectProperty
title: term data provider
range: DataProvider
definition: An external API or Endpoint that permits to retrieve the terms of this vocabulary.
in scheme: evorao

thirdPartyDistributionConsent
type: DatatypeProperty
title: third party distribution consent
range: boolean
definition: Indicates whether the biological material can be distributed without restriction to third parties, as indicated by the ABS permit, in case an ABS permit is required.
in scheme: evorao

toxicologicalInformation
type: DatatypeProperty
title: toxicological information
range: string
definition: Details on the potential health effects of the product, including routes of exposure (inhalation, ingestion, skin, eye contact), acute and chronic toxicity and symptoms of exposure.
in scheme: evorao

transportInformation
type: DatatypeProperty
title: transport information
range: string
definition: Details the regulations and guidelines for safely transporting the product, including classifications for road, air, sea, or rail transport, UN numbers, packaging requirements, and any special precautions to ensure safe transit.
in scheme: evorao

unitCost
type: DatatypeProperty
title: unit cost
range: decimal
definition: The cost per access for one unit as defined by the unit definition.
in scheme: evorao
note: The cost per access may not always be defined as a fixed numerical value. In some cases, the price is conditional or available only upon request. To accommodate such cases, descriptive information should be provided through the property EVORAO:unitCostNote (xsd:string). This allows handling of cost statements such as “on request,” “depends on volume,” or “free access for academics,” which cannot be captured by a simple numeric value.

unitCostCurrency
type: DatatypeProperty
title: unit cost currency
range: string
definition: The currency in which the unit cost is expressed, following ISO 4217 three-letter codes (e.g., EUR, USD).
in scheme: evorao

unitCostNote
type: DatatypeProperty
title: unit cost note
range: string
definition: A free-text note describing special conditions or cases where the cost cannot be represented by a numerical value (e.g., on request, free for academics, depends on volume).
in scheme: evorao

unitDefinition
type: DatatypeProperty
title: unit definition
range: string
definition: A short description of what will be delivered by ordering one unit of this item.
in scheme: evorao
note: The description of what will be delivered to the end-user (e.g.: packaging, quantity...).
related match: format

usageRestrictions
type: DatatypeProperty
title: usage restrictions
range: string
definition: Specifies any limitations or conditions on the use of the biological material, including restrictions on research, commercial use, or distribution, considering any potential concerns about the related genetic material.
in scheme: evorao

variant
type: ObjectProperty
range: Variant
definition: An organism with one or more new mutations is referred to as a “variant” of the original organism if not sufficiently different to be termed a distinct strain.
in scheme: evorao

versionDataProvider
type: ObjectProperty
title: version data provider
range: DataProvider
definition: The data provider for the Version ID of this taxonomy.
in scheme: evorao

versionOf
type: DatatypeProperty
title: version Of
range: string
definition: Identifier of what type of entities the version qualifies.
in scheme: evorao
related match: isVersionOf

Dataset
type: Class
subclass of: Restriction
  min cardinality: 1
  on property: title
subclass of: Restriction
  all values from: string
  on property: description
subclass of: Restriction
  all values from: string
  on property: version
subclass of: Restriction
  all values from: string
  on property: title
subclass of: Restriction
  min cardinality: 1
  on property: version
subclass of: Restriction
  max cardinality: 1
  on property: description
subclass of: Restriction
  max cardinality: 1
  on property: version
subclass of: Restriction
  min cardinality: 1
  on property: description
subclass of: Restriction
  max cardinality: 1
  on property: title
subclass of: Resource
definition: A collection of data, published or curated by a single agent, and available for access.
in scheme: evorao

servesDataset
type: ObjectProperty
title: serves dataset
range: Dataset
definition: A collection of data that this data service can distribute.
in scheme: evorao
note: This property rather intends to point towards Catalogues as collections of Datasets.

category
type: ObjectProperty
range: ProductCategory
definition: The main category of the service or product.
in scheme: evorao

BiologicalMaterialOrigin
type: Class
title: Biological material origin
subclass of: Restriction
  all values from: boolean
  on property: biologicalSourceType
subclass of: Restriction
  min cardinality: 1
  on property: biologicalSourceType
subclass of: Restriction
  all values from: BiologicalPartOrigin
  on property: biologicalPartOrigin
subclass of: Restriction
  min cardinality: 1
  on property: biologicalPartOrigin
subclass of: Restriction
  max cardinality: 1
  on property: recombinantMaterial
subclass of: Restriction
  min cardinality: 1
  on property: recombinantMaterial
subclass of: Restriction
  all values from: boolean
  on property: recombinantMaterial
subclass of: Restriction
  max cardinality: 1
  on property: biologicalSourceType
subclass of: Resource
definition: Information about the origin of the biological material, compulsory for access, utilization, and benefit-sharing of genetic resources in compliance with the Nagoya Protocol.
in scheme: evorao
related match: http://snomed.info/id/115668003

BiologicalPartOrigin
type: Class
title: Biological part origin
subclass of: Restriction
  min cardinality: 0
  on property: accessToPhysicalGeneticResource
subclass of: Restriction
  min cardinality: 0
  on property: recombinantPartIdentification
subclass of: Restriction
  all values from: RecombinantPartIdentification
  on property: recombinantPartIdentification
subclass of: Restriction
  all values from: boolean
  on property: accessToPhysicalGeneticResource
subclass of: Restriction
  max cardinality: 1
  on property: accessToPhysicalGeneticResource
subclass of: Restriction
  max cardinality: 1
  on property: recombinantPartIdentification
subclass of: Resource
broad match: SEPIO_0000058
definition: Information on the origin of a unitary, cohesive part that is part of, or constitutes the biological material. It can be multiple parts in case of a recombinant biological material.
in scheme: evorao

CommonName
type: Class
title: Common name
subclass of: Restriction
  min cardinality: 0
  on property: alternateName
subclass of: Restriction
  all values from: AlternateName
  on property: alternateName
subclass of: Restriction
  min cardinality: 0
  on property: sourceOfInformation
subclass of: Restriction
  all values from: string
  on property: sourceOfInformation
subclass of: Term
broad match: SIO_000118
definition: Vernacular name that is the name used in everyday language to refer to something like an organism or group of organisms. This name is typically easier to remember and pronounce compared to the scientific or technical name.
in scheme: evorao

Document
type: Class
subclass of: File
broad match: MediaType
definition: Subclass of File representing textual or written files such as reports, manuals, or forms.
in scheme: evorao

doi
type: ObjectProperty
title: DOI
range: Doi
broad match: bibliographicCitation
definition: A Digital Object Identifier (DOI) that can be related.
in scheme: evorao

sequenceReference
type: ObjectProperty
title: sequence reference
range: SequenceReference
definition: A reference that permits to retrieve the sequence information from a sequence provider.
in scheme: evorao

sourceOfInformation
type: DatatypeProperty
title: source of information
range: string
definition: The name of the origin from which knowledge is obtained. This can include any entity that provides information.
in scheme: evorao
related match: SIO_000253

taxonomy
type: ObjectProperty
range: Taxonomy
broad match: isPartOf
definition: The taxonomy release(s) in which this entity exists.
in scheme: evorao

ContactPoint
type: Class
title: Contact Point
subclass of: Restriction
  min cardinality: 0
  on property: addressLocality
subclass of: Restriction
  min cardinality: 0
  on property: addressCountry
subclass of: Restriction
  max cardinality: 1
  on property: telephone
subclass of: Restriction
  max cardinality: 1
  on property: addressRegion
subclass of: Restriction
  min cardinality: 0
  on property: postalCode
subclass of: Restriction
  all values from: string
  on property: addressRegion
subclass of: Restriction
  all values from: string
  on property: telephone
subclass of: Restriction
  all values from: string
  on property: email
subclass of: Restriction
  max cardinality: 1
  on property: addressCountry
subclass of: Restriction
  all values from: string
  on property: orcidId
subclass of: Restriction
  all values from: string
  on property: postalCode
subclass of: Restriction
  min cardinality: 0
  on property: description
subclass of: Restriction
  all values from: string
  on property: streetAddress
subclass of: Restriction
  max cardinality: 1
  on property: postalCode
subclass of: Restriction
  min cardinality: 1
  on property: name
subclass of: Restriction
  min cardinality: 0
  on property: streetAddress
subclass of: Restriction
  min cardinality: 0
  on property: orcidId
subclass of: Restriction
  max cardinality: 1
  on property: name
subclass of: Restriction
  min cardinality: 0
  on property: addressRegion
subclass of: Restriction
  all values from: Country
  on property: addressCountry
subclass of: Restriction
  max cardinality: 1
  on property: streetAddress
subclass of: Restriction
  all values from: string
  on property: addressLocality
subclass of: Restriction
  all values from: string
  on property: description
subclass of: Restriction
  min cardinality: 0
  on property: email
subclass of: Restriction
  max cardinality: 1
  on property: addressLocality
subclass of: Restriction
  max cardinality: 1
  on property: description
subclass of: Restriction
  min cardinality: 0
  on property: telephone
subclass of: Restriction
  max cardinality: 1
  on property: orcidId
subclass of: Restriction
  all values from: string
  on property: name
subclass of: Restriction
  max cardinality: 1
  on property: email
subclass of: Resource
definition: Entity serving as focal point of information.
in scheme: evorao
narrow match: PostalAddress
related match: Contact

Sequence
type: Class
subclass of: Restriction
  all values from: SequenceReference
  on property: sequenceReference
subclass of: Restriction
  all values from: string
  on property: sequenceFasta
subclass of: Restriction
  min cardinality: 0
  on property: sequenceReference
subclass of: Restriction
  max cardinality: 1
  on property: sequenceFasta
subclass of: Restriction
  min cardinality: 0
  on property: sequenceFasta
subclass of: Resource
definition: A nucleic acid or protein sequence information.
in scheme: evorao
related match: Sequence

rank
type: ObjectProperty
range: TaxonomicRank
definition: Relative level or position of the identified taxon in the taxonomy.
in scheme: evorao
related match: NCBITaxon has rank
related match: TAXRANK_1000000

publisher
type: ObjectProperty
range: PersonOrOrganization
definition: The entity responsible for making the resource available.
in scheme: evorao
note: Resources of type foaf:Agent like EVORAO:PersonOrOrganization are recommended as values for this property.

PersonOrOrganization
type: Class
title: Person or organization
subclass of: Restriction
  max cardinality: 1
  on property: description
subclass of: Restriction
  max cardinality: 1
  on property: contactPoint
subclass of: Restriction
  all values from: string
  on property: description
subclass of: Restriction
  min cardinality: 0
  on property: logo
subclass of: Restriction
  min cardinality: 0
  on property: homePage
subclass of: Restriction
  all values from: string
  on property: name
subclass of: Restriction
  all values from: anyURI
  on property: homePage
subclass of: Restriction
  all values from: Image
  on property: logo
subclass of: Restriction
  min cardinality: 0
  on property: description
subclass of: Restriction
  max cardinality: 1
  on property: logo
subclass of: Restriction
  all values from: ContactPoint
  on property: contactPoint
subclass of: Restriction
  min cardinality: 1
  on property: name
subclass of: Restriction
  min cardinality: 0
  on property: contactPoint
subclass of: Restriction
  max cardinality: 1
  on property: name
subclass of: Restriction
  max cardinality: 1
  on property: homePage
subclass of: Resource
definition: A person or an organization.
in scheme: evorao

AlternateName
type: Class
title: Alternate name
subclass of: Restriction
  min cardinality: 0
  on property: sourceOfInformation
subclass of: Restriction
  min cardinality: 0
  on property: alternateName
subclass of: Restriction
  all values from: string
  on property: sourceOfInformation
subclass of: Restriction
  all values from: AlternateName
  on property: alternateName
subclass of: Term
definition: List of other names for things.
in scheme: evorao

Country
type: Class
subclass of: Restriction
  min cardinality: 0
  on property: alpha2Code
subclass of: Restriction
  max cardinality: 1
  on property: alpha2Code
subclass of: Restriction
  all values from: string
  on property: alpha2Code
subclass of: Term
broad match: Location
definition: The country as of ISO3166.
in scheme: evorao
note: Use of Data provider recommended. It serves as a local cache for ISO3166.

Pathogen
type: Class
subclass of: Restriction
  all values from: string
  on property: titer
subclass of: Restriction
  min cardinality: 1
  on property: genomeSequencing
subclass of: Restriction
  all values from: string
  on property: isolationTechnique
subclass of: Restriction
  all values from: Datatype
    intersection of: string
    intersection of: Datatype
      one of: Complete genome
      one of: Complete coding sequence
      one of: Partial sequence
  on property: genomeSequencing
subclass of: Restriction
  all values from: PropagationHost
  on property: propagationHost
subclass of: Restriction
  min cardinality: 0
  on property: isolationHost
subclass of: Restriction
  all values from: TransmissionMethod
  on property: transmissionMethod
subclass of: Restriction
  all values from: string
  on property: clinicalInformation
subclass of: Restriction
  min cardinality: 0
  on property: isolationConditions
subclass of: Restriction
  all values from: Datatype
    intersection of: string
    intersection of: Datatype
      one of: Cultivable
      one of: Uncultivable
      one of: Inactivated
  on property: cultivability
subclass of: Restriction
  max cardinality: 1
  on property: infectivity
subclass of: Restriction
  min cardinality: 0
  on property: passage
subclass of: Restriction
  max cardinality: 1
  on property: letterOfAuthority
subclass of: Restriction
  all values from: BiologicalMaterialOrigin
  on property: biologicalMaterialOrigin
subclass of: Restriction
  all values from: Datatype
    intersection of: string
    intersection of: Datatype
      one of: Not applicable
      one of: Not required
      one of: Required for customers in the EU
      one of: Required
  on property: letterOfAuthority
subclass of: Restriction
  min cardinality: 1
  on property: infectivity
subclass of: Restriction
  max cardinality: 1
  on property: identificationTechnique
subclass of: Restriction
  min cardinality: 0
  on property: propagationHost
subclass of: Restriction
  min cardinality: 1
  on property: biologicalMaterialOrigin
subclass of: Restriction
  max cardinality: 1
  on property: passage
subclass of: Restriction
  min cardinality: 1
  on property: sequence
subclass of: Restriction
  all values from: string
  on property: infectivityTest
subclass of: Restriction
  all values from: string
  on property: passage
subclass of: Restriction
  min cardinality: 0
  on property: transmissionMethod
subclass of: Restriction
  all values from: IsolationHost
  on property: isolationHost
subclass of: Restriction
  min cardinality: 0
  on property: isolationTechnique
subclass of: Restriction
  min cardinality: 0
  on property: letterOfAuthority
subclass of: Restriction
  min cardinality: 0
  on property: suspectedEpidemiologicalOrigin
subclass of: Restriction
  max cardinality: 1
  on property: genomeSequencing
subclass of: Restriction
  max cardinality: 1
  on property: cultivability
subclass of: Restriction
  min cardinality: 0
  on property: productionCellLine
subclass of: Restriction
  min cardinality: 1
  on property: cultivability
subclass of: Restriction
  min cardinality: 0
  on property: infectivityTest
subclass of: Restriction
  min cardinality: 0
  on property: clinicalInformation
subclass of: Restriction
  max cardinality: 1
  on property: isolationConditions
subclass of: Restriction
  max cardinality: 1
  on property: titer
subclass of: Restriction
  all values from: Datatype
    intersection of: string
    intersection of: Datatype
      one of: Infectivity tested
      one of: Infectivity tested and quantified
      one of: Non cultivable sample, infectivity cannot be tested
  on property: infectivity
subclass of: Restriction
  min cardinality: 1
  on property: titer
subclass of: Restriction
  all values from: GeographicalOrigin
  on property: suspectedEpidemiologicalOrigin
subclass of: Restriction
  all values from: ProductionCellLine
  on property: productionCellLine
subclass of: Restriction
  max cardinality: 1
  on property: biologicalMaterialOrigin
subclass of: Restriction
  all values from: string
  on property: isolationConditions
subclass of: Restriction
  max cardinality: 1
  on property: isolationTechnique
subclass of: Restriction
  max cardinality: 1
  on property: infectivityTest
subclass of: Restriction
  all values from: string
  on property: identificationTechnique
subclass of: Restriction
  all values from: Sequence
  on property: sequence
subclass of: Restriction
  max cardinality: 1
  on property: clinicalInformation
subclass of: Restriction
  min cardinality: 0
  on property: identificationTechnique
subclass of: Product
definition: Biological entity that causes disease in its host, which is typically an infectious microorganism or agent, such as a virus, bacterium, protozoan, prion, viroid, or fungus.
in scheme: evorao
related match: DOID_0050117
related match: MONDO_0005550
related match: InfectiousAgentClass
related match: infectiousAgent

Product
type: Class
subclass of: Restriction
  min cardinality: 0
  on property: usageRestrictions
subclass of: Restriction
  max cardinality: 1
  on property: iataClassification
subclass of: Restriction
  all values from: string
  on property: usageRestrictions
subclass of: Restriction
  min cardinality: 1
  on property: shippingConditions
subclass of: Restriction
  all values from: boolean
  on property: thirdPartyDistributionConsent
subclass of: Restriction
  max cardinality: 1
  on property: storageConditions
subclass of: Restriction
  all values from: string
  on property: storageConditions
subclass of: Restriction
  max cardinality: 1
  on property: thirdPartyDistributionConsent
subclass of: Restriction
  all values from: string
  on property: preparationTechnique
subclass of: Restriction
  max cardinality: 1
  on property: shippingConditions
subclass of: Restriction
  min cardinality: 0
  on property: originator
subclass of: Restriction
  all values from: string
  on property: shippingConditions
subclass of: Restriction
  min cardinality: 0
  on property: thirdPartyDistributionConsent
subclass of: Restriction
  all values from: MaterialSafetyDataSheet
  on property: materialSafetyDataSheet
subclass of: Restriction
  max cardinality: 1
  on property: preparationTechnique
subclass of: Restriction
  max cardinality: 1
  on property: usageRestrictions
subclass of: Restriction
  min cardinality: 1
  on property: storageConditions
subclass of: Restriction
  max cardinality: 1
  on property: materialSafetyDataSheet
subclass of: Restriction
  all values from: Originator
  on property: originator
subclass of: Restriction
  min cardinality: 0
  on property: materialSafetyDataSheet
subclass of: Restriction
  min cardinality: 1
  on property: iataClassification
subclass of: Restriction
  max cardinality: 1
  on property: originator
subclass of: Restriction
  min cardinality: 0
  on property: preparationTechnique
subclass of: Restriction
  all values from: IataClassification
  on property: iataClassification
subclass of: ProductOrService
broad match: PhysicalResource
definition: A tangible, physical item made available by a provider for use, consumption, or ownership transfer.
in scheme: evorao
related match: Product

ProductCategory
type: Class
title: Product category
subclass of: Restriction
  max cardinality: 1
  on property: parentCategory
subclass of: Restriction
  min cardinality: 0
  on property: parentCategory
subclass of: Restriction
  all values from: ProductCategory
  on property: parentCategory
subclass of: Term
broad match: ConceptScheme
definition: A term used to classify a group of products that share common characteristics or functions, which helps in their organization.
in scheme: evorao
related match: CategoryCode

ProductOrService
type: Class
title: Product or service
subclass of: Restriction
  all values from: string
  on property: unitCostNote
subclass of: Restriction
  all values from: string
  on property: biosafetyRestrictions
subclass of: Restriction
  min cardinality: 0
  on property: biosafetyLevel
subclass of: Restriction
  all values from: Certification
  on property: certification
subclass of: Restriction
  min cardinality: 0
  on property: riskGroup
subclass of: Restriction
  max cardinality: 1
  on property: riskGroup
subclass of: Restriction
  min cardinality: 0
  on property: biosafetyRestrictions
subclass of: Restriction
  all values from: Collection
  on property: collection
subclass of: Restriction
  min cardinality: 0
  on property: unitCostCurrency
subclass of: Restriction
  min cardinality: 1
  on property: keywords
subclass of: Restriction
  min cardinality: 0
  on property: technicalRecommendation
subclass of: Restriction
  all values from: PathogenIdentification
  on property: pathogenIdentification
subclass of: Restriction
  all values from: string
  on property: technicalRecommendation
subclass of: Restriction
  min cardinality: 1
  on property: availability
subclass of: Restriction
  max cardinality: 1
  on property: provider
subclass of: Restriction
  max cardinality: 1
  on property: qualityGrading
subclass of: Restriction
  min cardinality: 0
  on property: canBeUsedToProduceGmo
subclass of: Restriction
  max cardinality: 1
  on property: biosafetyRestrictions
subclass of: Restriction
  all values from: ProductCategory
  on property: category
subclass of: Restriction
  all values from: Doi
  on property: doi
subclass of: Restriction
  all values from: string
  on property: refSku
subclass of: Restriction
  all values from: decimal
  on property: unitCost
subclass of: Restriction
  max cardinality: 1
  on property: category
subclass of: Restriction
  max cardinality: 1
  on property: biosafetyLevel
subclass of: Restriction
  max cardinality: 1
  on property: unitDefinition
subclass of: Restriction
  max cardinality: 1
  on property: canBeUsedToProduceGmo
subclass of: Restriction
  all values from: string
  on property: internalReference
subclass of: Restriction
  min cardinality: 0
  on property: doi
subclass of: Restriction
  min cardinality: 1
  on property: provider
subclass of: Restriction
  max cardinality: 1
  on property: refSku
subclass of: Restriction
  max cardinality: 1
  on property: unitCost
subclass of: Restriction
  all values from: string
  on property: unitCostCurrency
subclass of: Restriction
  max cardinality: 1
  on property: internalReference
subclass of: Restriction
  max cardinality: 1
  on property: contactPoint
subclass of: Restriction
  max cardinality: 1
  on property: unitCostNote
subclass of: Restriction
  all values from: string
  on property: qualityGrading
subclass of: Restriction
  min cardinality: 0
  on property: unitCost
subclass of: Restriction
  all values from: ProductCategory
  on property: additionalCategory
subclass of: Restriction
  min cardinality: 1
  on property: category
subclass of: Restriction
  min cardinality: 0
  on property: certification
subclass of: Restriction
  min cardinality: 1
  on property: refSku
subclass of: Restriction
  min cardinality: 0
  on property: externalRelatedReference
subclass of: Restriction
  min cardinality: 1
  on property: accessPointUrl
subclass of: Restriction
  all values from: RiskGroup
  on property: riskGroup
subclass of: Restriction
  all values from: string
  on property: note
subclass of: Restriction
  all values from: FundingSource
  on property: fundingSource
subclass of: Restriction
  all values from: BiosafetyLevel
  on property: biosafetyLevel
subclass of: Restriction
  min cardinality: 1
  on property: pathogenIdentification
subclass of: Restriction
  all values from: string
  on property: unitDefinition
subclass of: Restriction
  max cardinality: 1
  on property: availability
subclass of: Restriction
  max cardinality: 1
  on property: accessPointUrl
subclass of: Restriction
  min cardinality: 1
  on property: collection
subclass of: Restriction
  all values from: Image
  on property: productPicture
subclass of: Restriction
  min cardinality: 0
  on property: internalReference
subclass of: Restriction
  min cardinality: 0
  on property: complementaryDocument
subclass of: Restriction
  min cardinality: 0
  on property: fundingSource
subclass of: Restriction
  all values from: Keyword
  on property: keywords
subclass of: Restriction
  all values from: ContactPoint
  on property: contactPoint
subclass of: Restriction
  min cardinality: 0
  on property: unitDefinition
subclass of: Restriction
  all values from: anyURI
  on property: accessPointUrl
subclass of: Restriction
  min cardinality: 0
  on property: unitCostNote
subclass of: Restriction
  min cardinality: 0
  on property: qualityGrading
subclass of: Restriction
  min cardinality: 0
  on property: note
subclass of: Restriction
  min cardinality: 0
  on property: contactPoint
subclass of: Restriction
  min cardinality: 0
  on property: additionalCategory
subclass of: Restriction
  all values from: Document
  on property: complementaryDocument
subclass of: Dataset
definition: An offering provided by a provider, which may be tangible (a product) or intangible (a service).
in scheme: evorao
note: part of wd:Q2897903 (goods and services ).

identificationTechnique
type: DatatypeProperty
title: identification technique
range: string
definition: A method or procedure used to detect, identify, and confirm the presence of a specific nucleic acid sequence, pathogen, or associated constructs. This may involve various techniques such as PCR, sequencing, hybridization, or other molecular methods, utilizing specific tools and procedures for accurate detection and analysis.
in scheme: evorao

orcidId
type: DatatypeProperty
title: ORCID id
range: string
sub property of: identifier
definition: Unique persistent identifier for a person, provided by the Open Researcher and Contributor ID (ORCID) organisation.
in scheme: evorao
related match: data 4022
related match: IAO_0000708

resourceUrl
type: DatatypeProperty
title: resource URL
range: anyURI
sub property of: iri
broad match: url
definition: The web address or location where the details or content is stored and can be accessed or downloaded.
in scheme: evorao

specificityDocumented
type: DatatypeProperty
title: specificity documented
range: boolean
definition: Boolean value indicating whether the specificity of the product has been formally documented.
in scheme: evorao

tagSequence
type: ObjectProperty
title: tag sequence
range: TagSequence
definition: The name of the DNA coding sequence or corresponding peptide/protein sequence fused to a sequence of interest, used to facilitate experimental operations such as purification, detection, localization, tracking, solubility enhancement, or selection. Applicable to both proteins and nucleic acids.
in scheme: evorao
note: The tagSequence is strongly recommended for cloned nucleic acids and proteins but may be absent in certain cases, such as for some non-cloned nucleic acids.

titer
type: DatatypeProperty
range: string
definition: The titer value, its corresponding unit, and the method of quantification (e.g., RT-qPCR, TCID50), representing the concentration or amount of unit present in the sample. The titer corresponds to the highest dilution factor that still yields a positive reading.
in scheme: evorao
related match: Q2166189

weight
type: DatatypeProperty
range: integer
definition: A numerical value indicating relative importance or priority, generally processed in ascending order. This weight helps prioritize content when organizing or processing data. Its value can be negative, with a default set to 0.
in scheme: evorao
note: The lowest weighted Data providers are triggered first.
note: This property may be usefull to populate at first entities that are referenced by others (e.g. Version ahead of Rank ahead of Taxon).

contactPoint
type: ObjectProperty
title: contact point
range: ContactPoint
definition: An information that allows someone to establish communication.
in scheme: evorao

Organization
type: Class
subclass of: Restriction
  all values from: string
  on property: rorId
subclass of: Restriction
  all values from: Country
  on property: country
subclass of: Restriction
  min cardinality: 0
  on property: country
subclass of: Restriction
  all values from: AlternateName
  on property: alternateName
subclass of: Restriction
  max cardinality: 1
  on property: rorId
subclass of: Restriction
  min cardinality: 0
  on property: rorId
subclass of: Restriction
  max cardinality: 1
  on property: country
subclass of: Restriction
  min cardinality: 0
  on property: alternateName
subclass of: PersonOrOrganization
definition: A social entity established to meet needs or pursue specific goals.
in scheme: evorao

File
type: Class
subclass of: Restriction
  all values from: string
  on property: name
subclass of: Restriction
  min cardinality: 1
  on property: contentUrl
subclass of: Restriction
  min cardinality: 0
  on property: description
subclass of: Restriction
  all values from: string
  on property: format
subclass of: Restriction
  min cardinality: 1
  on property: name
subclass of: Restriction
  max cardinality: 1
  on property: description
subclass of: Restriction
  all values from: anyURI
  on property: contentUrl
subclass of: Restriction
  min cardinality: 0
  on property: license
subclass of: Restriction
  max cardinality: 1
  on property: format
subclass of: Restriction
  max cardinality: 1
  on property: license
subclass of: Restriction
  all values from: License
  on property: license
subclass of: Restriction
  min cardinality: 1
  on property: format
subclass of: Restriction
  all values from: string
  on property: description
subclass of: Restriction
  max cardinality: 1
  on property: name
subclass of: Restriction
  max cardinality: 1
  on property: contentUrl
subclass of: Resource
broad match: MediaType
definition: Digital document or record stored in a specific format that contains data or information.
in scheme: evorao

Image
type: Class
subclass of: Restriction
  min cardinality: 0
  on property: altText
subclass of: Restriction
  all values from: string
  on property: altText
subclass of: Restriction
  max cardinality: 1
  on property: altText
subclass of: File
broad match: MediaType
definition: Subclass of File representing visual content such as pictures, diagrams, or illustrations.
in scheme: evorao

taxon
type: ObjectProperty
range: Taxon
definition: Scientifically classified group or entity within the reference taxonomy.
in scheme: evorao
note: The taxon of the highest rank known that can be used to classify a pathogen or group of pathogens (e.g viruses) in the reference taxonomy.
related match: Taxon

license
type: ObjectProperty
range: License
definition: Information about terms and conditions under which the subject can be used, shared, or distributed, indicating any restrictions or permissions.
in scheme: evorao

sequence
type: ObjectProperty
range: Sequence
definition: The related sequence information from a sequence provider or in fasta format.
in scheme: evorao
note: Sequence information is logically one of the minimal quality requirements for entities such as pathogens, nucleic acids, and proteins, and should always be provided. However, in some rare cases, a nucleic acid may still be valuable even if it has not been sequenced after being extracted from identified material. In such exceptional cases, the sequence may legitimately be missing.
related match: sequence

version
type: DatatypeProperty
range: string
definition: The version indicator (name or identifier) of a resource.
in scheme: evorao
related match: identifier

name
type: DatatypeProperty
range: string
definition: A word or set of words used to identify and refer to an entity.
in scheme: evorao

biologicalMaterialOrigin
type: ObjectProperty
title: biological material origin
range: BiologicalMaterialOrigin
definition: Information about the origin of the biological material, essential for access, utilization, and benefit-sharing of genetic resources in compliance with the Nagoya Protocol.
in scheme: evorao
related match: SEPIO_0000058

iri
type: DatatypeProperty
title: IRI
range: anyURI
sub property of: identifier
definition: International Resource Identifier (IRI) that uniquely identifies or refers to the resource. IRIs include URIs, and URIs include URLs.
in scheme: evorao
narrow match: url
note: An IRI is a global identifier standardized by IETF RFC 3987. It may or may not be resolvable on the web. IRIs include URIs, and URIs include URLs.
related match: MI url

DataProvider
type: Class
title: Data provider
subclass of: Restriction
  all values from: anyURI
  on property: loginUrl
subclass of: Restriction
  all values from: string
  on property: loginTokenName
subclass of: Restriction
  max cardinality: 1
  on property: loginRequestMethod
subclass of: Restriction
  max cardinality: 1
  on property: loginUrl
subclass of: Restriction
  min cardinality: 1
  on property: providedEntityType
subclass of: Restriction
  all values from: integer
  on property: weight
subclass of: Restriction
  min cardinality: 0
  on property: loginTokenName
subclass of: Restriction
  min cardinality: 1
  on property: weight
subclass of: Restriction
  max cardinality: 1
  on property: license
subclass of: Restriction
  min cardinality: 0
  on property: license
subclass of: Restriction
  all values from: Datatype
    intersection of: string
    intersection of: Datatype
      one of: GET
      one of: POST
  on property: queryMethod
subclass of: Restriction
  min cardinality: 1
  on property: queryMethod
subclass of: Restriction
  max cardinality: 1
  on property: contentType
subclass of: Restriction
  all values from: anyURI
  on property: providedEntityType
subclass of: Restriction
  max cardinality: 1
  on property: loginTokenName
subclass of: Restriction
  all values from: License
  on property: license
subclass of: Restriction
  all values from: string
  on property: contentType
subclass of: Restriction
  max cardinality: 1
  on property: queryMethod
subclass of: Restriction
  max cardinality: 1
  on property: weight
subclass of: Restriction
  min cardinality: 0
  on property: loginRequestMethod
subclass of: Restriction
  min cardinality: 0
  on property: loginUrl
subclass of: Restriction
  min cardinality: 1
  on property: contentType
subclass of: Restriction
  all values from: Datatype
    intersection of: string
    intersection of: Datatype
      one of: GET
      one of: POST
  on property: loginRequestMethod
subclass of: DataService
broad match: EntryPoint
definition: An external API (Application Programming Interface) or Endpoint that permits to retrieve data from other sources.
in scheme: evorao

Taxon
type: Class
subclass of: Restriction
  all values from: Taxon
  on property: previouslyKnownAs
subclass of: Restriction
  min cardinality: 0
  on property: taxonomy
subclass of: Restriction
  all values from: string
  on property: taxonomicNodeId
subclass of: Restriction
  all values from: string
  on property: lineage
subclass of: Restriction
  min cardinality: 0
  on property: lineage
subclass of: Restriction
  all values from: Taxonomy
  on property: taxonomy
subclass of: Restriction
  min cardinality: 0
  on property: rank
subclass of: Restriction
  max cardinality: 1
  on property: taxonomicId
subclass of: Restriction
  all values from: Taxon
  on property: externalEquivalentTaxon
subclass of: Restriction
  all values from: string
  on property: taxonomicId
subclass of: Restriction
  min cardinality: 1
  on property: taxonomicId
subclass of: Restriction
  min cardinality: 0
  on property: externalEquivalentTaxon
subclass of: Restriction
  all values from: Taxon
  on property: parentTaxon
subclass of: Restriction
  min cardinality: 0
  on property: alternateName
subclass of: Restriction
  min cardinality: 0
  on property: taxonomicNodeId
subclass of: Restriction
  all values from: AlternateName
  on property: alternateName
subclass of: Restriction
  min cardinality: 0
  on property: previouslyKnownAs
subclass of: Restriction
  max cardinality: 1
  on property: rank
subclass of: Restriction
  min cardinality: 0
  on property: parentTaxon
subclass of: Restriction
  max cardinality: 1
  on property: taxonomicNodeId
subclass of: Restriction
  all values from: TaxonomicRank
  on property: rank
subclass of: Restriction
  max cardinality: 1
  on property: parentTaxon
subclass of: Term
definition: Conceptual entity that groups one or more populations of an organism or organisms, as seen by taxonomists, to form a unit.
in scheme: evorao
note: The taxonomic taxons connected to their parent so that a full lienage can be rebuild.
note: Use of Data provider recommended.

alternateName
type: ObjectProperty
title: alternate name
range: AlternateName
definition: Any other name under which the entity can be known.
in scheme: evorao
note: This includes previous names, acronyms, former taxonomic terms, and other variations.
note: This information can serve as keywords for search purposes and as a bridge with other projects that use different naming systems or taxonomies.

logo
type: ObjectProperty
range: Image
definition: A path or URL to the related logo.
in scheme: evorao

identifier
type: DatatypeProperty
range: string
definition: A unique identifier of the resource being described or cataloged.
in scheme: evorao
note: The identifier is a text string which is assigned to the resource to provide an unambiguous reference within a particular context. Persistent identifiers should be provided as HTTP URIs.

Resource
type: Class
subclass of: Restriction
  min cardinality: 0
  on property: dateIssued
subclass of: Restriction
  all values from: PersonOrOrganization
  on property: publisher
subclass of: Restriction
  all values from: string
  on property: identifier
subclass of: Restriction
  min cardinality: 0
  on property: iri
subclass of: Restriction
  all values from: dateTime
  on property: dateIssued
subclass of: Restriction
  min cardinality: 0
  on property: keyword
subclass of: Restriction
  all values from: dateTime
  on property: dateModified
subclass of: Restriction
  min cardinality: 0
  on property: publisher
subclass of: Restriction
  all values from: anyURI
  on property: iri
subclass of: Restriction
  max cardinality: 1
  on property: dateIssued
subclass of: Restriction
  min cardinality: 0
  on property: identifier
subclass of: Restriction
  max cardinality: 1
  on property: publisher
subclass of: Restriction
  all values from: string
  on property: keyword
subclass of: Restriction
  max cardinality: 1
  on property: dateModified
subclass of: Restriction
  min cardinality: 0
  on property: dateModified
definition: Resource published or curated by a single agent.
in scheme: evorao

title
type: DatatypeProperty
range: string
definition: A name given to the resource.
in scheme: evorao
note: E.g. for virus products it should basically be based on the following Pattern: 'Virus name', 'virus host type', 'collection year', 'country of collection' ex 'suspected epidemiological origin', 'genotype', 'strain', 'variant name or specific feature.
note: The title of the item should be as short and descriptive as possible.

Term
type: Class
subclass of: Restriction
  max cardinality: 1
  on property: title
subclass of: Restriction
  min cardinality: 0
  on property: inVocabulary
subclass of: Restriction
  max cardinality: 1
  on property: weight
subclass of: Restriction
  all values from: string
  on property: title
subclass of: Restriction
  all values from: integer
  on property: weight
subclass of: Restriction
  all values from: string
  on property: description
subclass of: Restriction
  min cardinality: 0
  on property: description
subclass of: Restriction
  min cardinality: 1
  on property: title
subclass of: Restriction
  max cardinality: 1
  on property: description
subclass of: Restriction
  max cardinality: 1
  on property: inVocabulary
subclass of: Restriction
  all values from: Vocabulary
  on property: inVocabulary
subclass of: Restriction
  min cardinality: 0
  on property: weight
subclass of: Resource
definition: Word or phrase from a specialized area of knowledge.
in scheme: evorao
narrow match: Q12812139

description
type: DatatypeProperty
range: string
definition: A short explanation of the characteristics, features, or nature of the current item.
in scheme: evorao
note: Describe this item in few lines. This description will serve as a summary to present the resource.

Restriction
max cardinality: 1
on property: unitCostCurrency

Restriction
max cardinality: 1
on property: note

Restriction
max cardinality: 1
on property: technicalRecommendation

Restriction
min cardinality: 0
on property: productPicture